build error Revision 3130

gorgone

Neuer User
Mitglied seit
6 Jun 2008
Beiträge
8
Punkte für Reaktionen
0
Punkte
0
hi

wenn ich hier falsch bin bitte nicht schlagen ;-)

ich bekommen beim build folgenden fehler

Code:
    rm build/modified/filesystem/usr/www/all/html/de/konfig
    rm build/modified/filesystem/usr/www/all/html/index_assi.html
    rm build/modified/filesystem/usr/www/all/html/assistent.html
    applying patch file ./patches/cond/de/remove_assistant_7270.patch
    patching file usr/www/all/html/de/home/sitemap.html
    Hunk #1 FAILED at 24.
    1 out of 1 hunk FAILED -- saving rejects to file usr/www/all/html/de/home/sitemap.html.rej
    patching file usr/www/all/html/de/js/basis.js
    patching file usr/www/all/html/de/menus/menu2_konfig.html
    Hunk #1 FAILED at 14.
    Hunk #2 FAILED at 56.
    2 out of 2 hunks FAILED -- saving rejects to file usr/www/all/html/de/menus/menu2_konfig.html.rej
    patching file usr/www/all/html/logincheck.html
    Hunk #1 succeeded at 118 (offset -6 lines).
    ----------------------------------------------------------------------
ERROR: modpatch: Error in patch-file ./patches/cond/de/remove_assistant_7270.patch
make: *** [firmware-nocompile] Fehler 2
 
Ohne deine .config kommen wir da nicht weit.
 
danke :-) passt

mit der stable 70 gings auch

in welchen intervallen werden die labor eingebunden ? es gibt ja ständig neue ..

die letzte mir bekannte ist Klick_13783 und nicht die Klick_13225
 
Das eine ist die dsl, das andere die ipv6 oder die "störquellen"
 
Oder so ;) Ist recht egal. Eingepflegt werden sie, wenn sie auftauchen und jemand Zeit hat (zumindest bei simplen updates). Bei "neuen" wie die ipv6, die ein wenig mehr Pflege erwarten, dauert es halt ein wenig, oder aber - so ist es hier passiert - wird erst einmal ein Patch bereitgestellt, den man testen soll.
 
Kostenlos!

Statistik des Forums

Themen
248,920
Beiträge
2,305,126
Mitglieder
378,645
Neuestes Mitglied
nikitarajusa