[Problem] buildfehler / aktueller trunk / squid

Status
Für weitere Antworten geschlossen.

xsapling

Mitglied
Mitglied seit
30 Jan 2005
Beiträge
755
Punkte für Reaktionen
0
Punkte
0
was ist zu tun?

Code:
make[5]: Betrete Verzeichnis '/home/freetz/7490/freetz-7490-start/source/target-mips_gcc-4.6.4_uClibc-0.9.32.1/squid-3.0.STABLE26/lib/libTrie/src'
/home/freetz/7490/freetz-7490-start/toolchain/build/mips_gcc-4.6.4_uClibc-0.9.32.1/mips-linux-uclibc/bin/mips-linux-uclibc-g++-wrapper -DHAVE_CONFIG_H -I. -I.. -I../include   -Werror -Wall -Wpointer-arith -Wwrite-strings -Wcomments  -march=24kc -Os -pipe -Wa,--trap -D_LARGEFILE_SOURCE -D_LARGEFILE64_SOURCE -D_FILE_OFFSET_BITS=64 -MT Trie.o -MD -MP -MF .deps/Trie.Tpo -c -o Trie.o Trie.cc
/home/freetz/7490/freetz-7490-start/toolchain/build/mips_gcc-4.6.4_uClibc-0.9.32.1/mips-linux-uclibc/bin/mips-linux-uclibc-g++-wrapper -DHAVE_CONFIG_H -I. -I.. -I../include   -Werror -Wall -Wpointer-arith -Wwrite-strings -Wcomments  -march=24kc -Os -pipe -Wa,--trap -D_LARGEFILE_SOURCE -D_LARGEFILE64_SOURCE -D_FILE_OFFSET_BITS=64 -MT TrieNode.o -MD -MP -MF .deps/TrieNode.Tpo -c -o TrieNode.o TrieNode.cc
In file included from ../include/Trie.cci:22:0,
                 from ../include/Trie.h:97,
                 from Trie.cc:20:
../include/TrieNode.h:40:19: fatal error: utility: No such file or directory
compilation terminated.
make[5]: *** [Trie.o] Fehler 1
make[5]: *** Warte auf noch nicht beendete Prozesse...
In file included from TrieNode.cc:20:0:
../include/TrieNode.h:40:19: fatal error: utility: No such file or directory
compilation terminated.
make[5]: *** [TrieNode.o] Fehler 1
make[5]: Verlasse Verzeichnis '/home/freetz/7490/freetz-7490-start/source/target-mips_gcc-4.6.4_uClibc-0.9.32.1/squid-3.0.STABLE26/lib/libTrie/src'
make[4]: *** [all-recursive] Fehler 1
make[4]: Verlasse Verzeichnis '/home/freetz/7490/freetz-7490-start/source/target-mips_gcc-4.6.4_uClibc-0.9.32.1/squid-3.0.STABLE26/lib/libTrie'
make[3]: *** [all] Fehler 2
make[3]: Verlasse Verzeichnis '/home/freetz/7490/freetz-7490-start/source/target-mips_gcc-4.6.4_uClibc-0.9.32.1/squid-3.0.STABLE26/lib/libTrie'
make[2]: *** [all-recursive] Fehler 1
make[2]: Verlasse Verzeichnis '/home/freetz/7490/freetz-7490-start/source/target-mips_gcc-4.6.4_uClibc-0.9.32.1/squid-3.0.STABLE26/lib'
make[1]: *** [all-recursive] Fehler 1
make[1]: Verlasse Verzeichnis '/home/freetz/7490/freetz-7490-start/source/target-mips_gcc-4.6.4_uClibc-0.9.32.1/squid-3.0.STABLE26'


ERROR: Build failed.
make: *** [source/target-mips_gcc-4.6.4_uClibc-0.9.32.1/squid-3.0.STABLE26/src/squid] Fehler 1
freetz@freetz-linux:~/7490/freetz-7490-start$
 
Ich kann squid bei mir problemlos bauen. Der von der gepostete Fehler passiert, weil bei dir etwas mit der uclibc++ nicht stimmt!?

Probier mal bitte folgendes:
Code:
make uclibcxx-dirclean uclibcxx-precompiled
make squid-dirclean squid-precompiled

Gruß
Oliver
 
Danke. Bei klappte es zwischenzeitlich auch wieder. Ich hatte mich mit einem kompletten dirclean beholfen.
 
Okay. Dann mach ich hier mal zu.

Gruß
Oliver
 
Status
Für weitere Antworten geschlossen.
Kostenlos!

Statistik des Forums

Themen
248,919
Beiträge
2,305,081
Mitglieder
378,640
Neuestes Mitglied
vapep43913