[Problem] BuildProblem

muclove

Neuer User
Mitglied seit
15 Jun 2012
Beiträge
16
Punkte für Reaktionen
0
Punkte
1
Hallo,

versuche Freetz zu bauen aber leider endet es immer mit nem Fehler:

Code:
libtool: compile:  /home/peter/freetz-trunk/toolchain/build/mipsel_gcc-4.6.4_uClibc-0.9.32.1/mipsel-linux-uclibc/bin/mipsel-linux-uclibc-gcc -std=gnu99 -DHAVE_CONFIG_H -I. -I.. -D__GMP_WITHIN_GMP -I.. -DOPERATION_toom_eval_pm2exp -march=4kc -Os -pipe -Wa,--trap -D_LARGEFILE_SOURCE -D_LARGEFILE64_SOURCE -D_FILE_OFFSET_BITS=64 -c toom_eval_pm2exp.c  -fPIC -DPIC -o .libs/toom_eval_pm2exp.o
make[3]: *** [toom_eval_pm2.lo] Error 1
make[3]: *** Waiting for unfinished jobs....
libtool: compile:  /home/peter/freetz-trunk/toolchain/build/mipsel_gcc-4.6.4_uClibc-0.9.32.1/mipsel-linux-uclibc/bin/mipsel-linux-uclibc-gcc -std=gnu99 -DHAVE_CONFIG_H -I. -I.. -D__GMP_WITHIN_GMP -I.. -DOPERATION_toom_eval_pm2exp -march=4kc -Os -pipe -Wa,--trap -D_LARGEFILE_SOURCE -D_LARGEFILE64_SOURCE -D_FILE_OFFSET_BITS=64 -c toom_eval_pm2exp.c -o toom_eval_pm2exp.o >/dev/null 2>&1
make[2]: *** [all-recursive] Error 1
make[1]: *** [all] Error 2

ERROR: Build failed. Please re-run make with verbose level set to 2 to see what's going on.
make: *** [source/target-mipsel_gcc-4.6.4_uClibc-0.9.32.1/gmp-5.1.3/.libs/libgmp.so.10.1.3] Error 1
peter@ubuntu:~/freetz-trunk$

Hoffen jemand kann mir weiterhelfen.
Gruß
 
Welche VM nutzt du ? 1.3.1 oder 1.3.2 ?
 
Was meinst du? Nutze Vmware Workstation. hab eignes image da das vmware teil mit vmware nicht läuft
 
Zuletzt bearbeitet:
Nimm mal das Freetz-Linux als Buildumgebung
 
In deinem Log fehlt der Fehler. Der steht vorne dran... Und bitte die .config anhängen.

Gruß Oliver
 
Kostenlos!

Statistik des Forums

Themen
248,917
Beiträge
2,305,038
Mitglieder
378,638
Neuestes Mitglied
Patrick89