.titleBar { margin-bottom: 5px!important; }

asterisk compiliert mit spandsp nicht,

Dieses Thema im Forum "Asterisk Allgemein" wurde erstellt von Hias-online, 19 Jan. 2007.

  1. Hias-online

    Hias-online Neuer User

    Registriert seit:
    16 Nov. 2005
    Beiträge:
    124
    Zustimmungen:
    0
    Punkte für Erfolge:
    0
    hi,

    hab mir bristuff-0.3.0-PRE-1x.tar.gz runtergeladen,
    und libtiff, sowie spandsp-0.0.2pre26.tar.gz kompiliert,

    wenn ich jetzt jedoch asterisk(asterisk-1.2.14) kompilieren will kommt folgende fehler:
    Code:
    
    app_rxfax.c: In Funktion »phase_e_handler«:
    app_rxfax.c:105: error: structure has no member named `column_resolution'
    app_rxfax.c:105: error: structure has no member named `row_resolution'
    app_rxfax.c:116: error: structure has no member named `row_resolution'
    app_rxfax.c:122: error: structure has no member named `row_resolution'
    app_rxfax.c: In Funktion »phase_d_handler«:
    app_rxfax.c:147: error: structure has no member named `columns'
    app_rxfax.c:147: error: structure has no member named `rows'
    app_rxfax.c:148: error: structure has no member named `column_resolution'
    app_rxfax.c:148: error: structure has no member named `row_resolution'
    app_rxfax.c: In Funktion »rxfax_exec«:
    app_rxfax.c:176: error: conflicting types for `t'
    app_rxfax.c:165: error: previous declaration of `t'
    app_rxfax.c:211: error: incompatible types in Zuweisung
    app_rxfax.c:214: error: invalid operands to binary -
    app_rxfax.c:214: error: incompatible type for argument 1 of `strlen'
    app_rxfax.c:214: error: invalid operands to binary -
    app_rxfax.c:214: error: invalid operands to binary -
    app_rxfax.c:214: error: incompatible type for argument 2 of `memcpy'
    app_rxfax.c:214: error: invalid operands to binary -
    app_rxfax.c:214: error: incompatible type for argument 2 of `strncpy'
    app_rxfax.c:214: error: invalid operands to binary -
    app_rxfax.c:214: error: incompatible type for argument 2 of `strncpy'
    app_rxfax.c:215: error: invalid operands to binary -
    app_rxfax.c:219: error: invalid operands to binary -
    app_rxfax.c:222: error: incompatible type for argument 1 of `strlen'
    app_rxfax.c:222: error: incompatible type for argument 2 of `memcpy'
    app_rxfax.c:222: error: incompatible type for argument 2 of `strncpy'
    app_rxfax.c:222: error: incompatible type for argument 2 of `strncpy'
    app_rxfax.c:238: error: invalid operands to binary -
    app_rxfax.c:238: error: invalid operands to binary -
    app_rxfax.c:238: error: incompatible type for argument 1 of `strlen'
    app_rxfax.c:238: error: invalid operands to binary -
    app_rxfax.c:238: error: incompatible type for argument 1 of `strlen'
    app_rxfax.c:238: error: invalid operands to binary +
    app_rxfax.c:238: error: cannot convert to a pointer type
    app_rxfax.c:238: error: cannot convert to a pointer type
    app_rxfax.c:238: error: invalid operands to binary +
    app_rxfax.c:238: error: cannot convert to a pointer type
    app_rxfax.c:238: error: cannot convert to a pointer type
    app_rxfax.c:238: error: cannot convert to a pointer type
    app_rxfax.c:238: error: cannot convert to a pointer type
    app_rxfax.c:238: error: cannot convert to a pointer type
    app_rxfax.c:238: error: cannot convert to a pointer type
    app_rxfax.c:238: error: invalid operands to binary +
    app_rxfax.c:238: error: cannot convert to a pointer type
    app_rxfax.c:238: error: incompatible type for argument 1 of `strlen'
    app_rxfax.c:238: error: cannot convert to a pointer type
    app_rxfax.c:238: error: cannot convert to a pointer type
    app_rxfax.c:238: error: cannot convert to a pointer type
    app_rxfax.c:238: error: cannot convert to a pointer type
    app_rxfax.c:238: error: cannot convert to a pointer type
    app_rxfax.c:238: error: cannot convert to a pointer type
    app_rxfax.c:238: error: cannot convert to a pointer type
    app_rxfax.c:238: error: cannot convert to a pointer type
    app_rxfax.c:238: error: incompatible type for argument 2 of `strcmp'
    app_rxfax.c:238: error: invalid operands to binary -
    app_rxfax.c:238: error: incompatible type for argument 2 of `strncmp'
    app_rxfax.c:242: error: invalid operands to binary -
    app_rxfax.c:242: error: invalid operands to binary -
    app_rxfax.c:242: error: incompatible type for argument 1 of `strlen'
    app_rxfax.c:242: error: invalid operands to binary -
    app_rxfax.c:242: error: incompatible type for argument 1 of `strlen'
    app_rxfax.c:242: error: invalid operands to binary +
    app_rxfax.c:242: error: cannot convert to a pointer type
    app_rxfax.c:242: error: cannot convert to a pointer type
    app_rxfax.c:242: error: invalid operands to binary +
    app_rxfax.c:242: error: cannot convert to a pointer type
    app_rxfax.c:242: error: cannot convert to a pointer type
    app_rxfax.c:242: error: cannot convert to a pointer type
    app_rxfax.c:242: error: cannot convert to a pointer type
    app_rxfax.c:242: error: cannot convert to a pointer type
    app_rxfax.c:242: error: cannot convert to a pointer type
    app_rxfax.c:242: error: invalid operands to binary +
    app_rxfax.c:242: error: cannot convert to a pointer type
    app_rxfax.c:242: error: incompatible type for argument 1 of `strlen'
    app_rxfax.c:242: error: cannot convert to a pointer type
    app_rxfax.c:242: error: cannot convert to a pointer type
    app_rxfax.c:242: error: cannot convert to a pointer type
    app_rxfax.c:242: error: cannot convert to a pointer type
    app_rxfax.c:242: error: cannot convert to a pointer type
    app_rxfax.c:242: error: cannot convert to a pointer type
    app_rxfax.c:242: error: cannot convert to a pointer type
    app_rxfax.c:242: error: cannot convert to a pointer type
    app_rxfax.c:242: error: incompatible type for argument 2 of `strcmp'
    app_rxfax.c:242: error: invalid operands to binary -
    app_rxfax.c:242: error: incompatible type for argument 2 of `strncmp'
    app_rxfax.c:284: Warnung: Verarbeiten des Argumentes 1 von »fax_init« von inkompatiblem Zeigertyp
    app_rxfax.c:284: error: too many arguments to function `fax_init'
    app_rxfax.c:307: Warnung: Verarbeiten des Argumentes 1 von »fax_rx« von inkompatiblem Zeigertyp
    app_rxfax.c:310: Warnung: Verarbeiten des Argumentes 1 von »fax_tx« von inkompatiblem Zeigertyp
    app_rxfax.c:327: Warnung: Verarbeiten des Argumentes 1 von »fax_tx« von inkompatiblem Zeigertyp
    app_rxfax.c:368: Warnung: Verarbeiten des Argumentes 1 von »fax_release« von inkompatiblem Zeigertyp
    app_rxfax.c:375: error: invalid type argument of `->'
    app_rxfax.c: Auf höchster Ebene:
    app_rxfax.c:81: Warnung: `t30_flush' defined but not used
    make[1]: *** [app_rxfax.o] Fehler 1
    make[1]: Leaving directory `/usr/src/asterisk/bristuff-0.3.0-PRE-1x/asterisk-1.2.14/apps'
    make: *** [subdirs] Fehler 1