.titleBar { margin-bottom: 5px!important; }

Asterisk lässt sich nicht installieren

Dieses Thema im Forum "Asterisk Allgemein" wurde erstellt von Freddchen, 9 Okt. 2006.

  1. Freddchen

    Freddchen Neuer User

    Registriert seit:
    29 Dez. 2005
    Beiträge:
    7
    Zustimmungen:
    0
    Punkte für Erfolge:
    0
    hallo zusammen,

    wenn ich auf meinem debian server (kein vServer) asterisk kompilieren will gibt es eine reihe von fehlermeldungen. ansich habe ich den asterisk schon mit apt-get install installiert brauche aber wohl die kompilierte version um die addons zu installieren. hier die fehlerausgabe nach eingabe von make :

    vielleicht kann mir ja jemand sagen was mir oder dem server fehlt ;)

    Code:
    build_tools/make_version_h > include/asterisk/version.h.tmp
    if cmp -s include/asterisk/version.h.tmp include/asterisk/version.h ; then echo; else \
    	mv include/asterisk/version.h.tmp include/asterisk/version.h ; \
    fi
    
    rm -f include/asterisk/version.h.tmp
    if cmp -s .cleancount .lastclean ; then echo ; else \
    	make clean; cp -f .cleancount .lastclean;\
    fi
    
    build_tools/make_defaults_h > defaults.h.tmp
    if cmp -s defaults.h.tmp defaults.h ; then echo ; else \
    	mv defaults.h.tmp defaults.h ; \
    fi
    
    rm -f defaults.h.tmp
    for x in res channels pbx apps codecs formats agi cdr funcs utils stdtime; do make -C $x depend || exit 1 ; done
    make[1]: Entering directory `/usr/src/asterisk/res'
    make[1]: Für das Ziel »depend« ist nichts zu tun.
    make[1]: Leaving directory `/usr/src/asterisk/res'
    make[1]: Entering directory `/usr/src/asterisk/channels'
    make[1]: Für das Ziel »depend« ist nichts zu tun.
    make[1]: Leaving directory `/usr/src/asterisk/channels'
    make[1]: Entering directory `/usr/src/asterisk/pbx'
    make[1]: Für das Ziel »depend« ist nichts zu tun.
    make[1]: Leaving directory `/usr/src/asterisk/pbx'
    /bin/sh: line 1: curl-config: command not found
    make[1]: Entering directory `/usr/src/asterisk/apps'
    make[1]: Für das Ziel »depend« ist nichts zu tun.
    make[1]: Leaving directory `/usr/src/asterisk/apps'
    make[1]: Entering directory `/usr/src/asterisk/codecs'
    make[1]: Für das Ziel »depend« ist nichts zu tun.
    make[1]: Leaving directory `/usr/src/asterisk/codecs'
    make[1]: Entering directory `/usr/src/asterisk/formats'
    make[1]: Für das Ziel »depend« ist nichts zu tun.
    make[1]: Leaving directory `/usr/src/asterisk/formats'
    make[1]: Entering directory `/usr/src/asterisk/agi'
    make[1]: Für das Ziel »depend« ist nichts zu tun.
    make[1]: Leaving directory `/usr/src/asterisk/agi'
    make[1]: Entering directory `/usr/src/asterisk/cdr'
    make[1]: Für das Ziel »depend« ist nichts zu tun.
    make[1]: Leaving directory `/usr/src/asterisk/cdr'
    make[1]: Entering directory `/usr/src/asterisk/funcs'
    make[1]: Für das Ziel »depend« ist nichts zu tun.
    make[1]: Leaving directory `/usr/src/asterisk/funcs'
    make[1]: Entering directory `/usr/src/asterisk/utils'
    make[1]: Für das Ziel »depend« ist nichts zu tun.
    make[1]: Leaving directory `/usr/src/asterisk/utils'
    make[1]: Entering directory `/usr/src/asterisk/stdtime'
    make[1]: Für das Ziel »depend« ist nichts zu tun.
    make[1]: Leaving directory `/usr/src/asterisk/stdtime'
    cd editline && unset CFLAGS LIBS && test -f config.h || CFLAGS="-O6" ./configure
    make -C editline libedit.a
    make[1]: Entering directory `/usr/src/asterisk/editline'
    gcc -c  -O6 '-D__RCSID(x)=' '-D__COPYRIGHT(x)=' '-D__RENAME(x)=' '-D_DIAGASSERT(x)=' -I. editline.c -o editline.o_a
    In file included from /usr/include/stdio.h:28,
                     from sys.h:70,
                     from config.h:19,
                     from common.c:39,
                     from editline.c:4:
    /usr/include/features.h:46: error: Syntaxfehler before "AST_LIST_ENTRY"
    In file included from /usr/include/stdio.h:34,
                     from sys.h:70,
                     from config.h:19,
                     from common.c:39,
                     from editline.c:4:
    /usr/lib/gcc-lib/i486-linux/3.3.5/include/stddef.h:213: error: Syntaxfehler before "typedef"
    In file included from sys.h:70,
                     from config.h:19,
                     from common.c:39,
                     from editline.c:4:
    /usr/include/stdio.h:46: error: Syntaxfehler before "typedef"
    /usr/include/stdio.h:62: error: Syntaxfehler before "typedef"
    In file included from /usr/include/_G_config.h:44,
                     from /usr/include/libio.h:32,
                     from /usr/include/stdio.h:72,
                     from sys.h:70,
                     from config.h:19,
                     from common.c:39,
                     from editline.c:4:
    /usr/include/gconv.h:176: error: Syntaxfehler before "__flexarr"
    In file included from /usr/include/libio.h:32,
                     from /usr/include/stdio.h:72,
                     from sys.h:70,
                     from config.h:19,
                     from common.c:39,
                     from editline.c:4:
    /usr/include/_G_config.h:47: error: field `__cd' has incomplete type
    /usr/include/_G_config.h:50: error: field `__cd' has incomplete type
    In Datei, eingefügt von /usr/include/libio.h:62,
                        von /usr/include/stdio.h:72,
                        von sys.h:70,
                        von config.h:19,
                        von common.c:39,
                        von editline.c:4:
    /usr/include/sys/cdefs.h:43:43: fehlender binärer Operator vor Token »(«
    /usr/include/sys/cdefs.h:122:19: fehlender binärer Operator vor Token »(«
    /usr/include/sys/cdefs.h:173:19: fehlender binärer Operator vor Token »(«
    /usr/include/sys/cdefs.h:182:19: fehlender binärer Operator vor Token »(«
    /usr/include/sys/cdefs.h:191:19: fehlender binärer Operator vor Token »(«
    /usr/include/sys/cdefs.h:200:19: fehlender binärer Operator vor Token »(«
    /usr/include/sys/cdefs.h:212:19: fehlender binärer Operator vor Token »(«
    /usr/include/sys/cdefs.h:222:19: fehlender binärer Operator vor Token »(«
    /usr/include/sys/cdefs.h:233:20: fehlender binärer Operator vor Token »(«
    /usr/include/sys/cdefs.h:238:20: fehlender binärer Operator vor Token »(«
    /usr/include/sys/cdefs.h:245:19: fehlender binärer Operator vor Token »(«
    In Datei, eingefügt von el.h:54,
                        von common.c:51,
                        von editline.c:4:
    /usr/include/sys/types.h:158:20: fehlender binärer Operator vor Token »(«
    In file included from el.h:96,
                     from common.c:51,
                     from editline.c:4:
    tty.h:457: error: Syntaxfehler before "u_int"
    tty.h:457: Warnung: kein Semikolon am Ende von »struct« oder »union«
    tty.h:458: Warnung: data definition has no type or storage class
    tty.h:459: Warnung: data definition has no type or storage class
    tty.h:473: error: Syntaxfehler before "ttyperm_t"
    tty.h:473: Warnung: kein Semikolon am Ende von »struct« oder »union«
    tty.h:481: error: Syntaxfehler before '}' token
    tty.h:481: Warnung: data definition has no type or storage class
    In Datei, eingefügt von /usr/include/ctype.h:41,
                        von chared.h:47,
                        von el.h:101,
                        von common.c:51,
                        von editline.c:4:
    /usr/include/endian.h:58:2: #error Need to know endianess
    In Datei, eingefügt von /usr/include/string.h:375,
                        von chared.h:48,
                        von el.h:101,
                        von common.c:51,
                        von editline.c:4:
    /usr/include/bits/string2.h:191:20: fehlender binärer Operator vor Token »(«
    /usr/include/bits/string2.h:398:58: fehlender binärer Operator vor Token »(«
    /usr/include/bits/string2.h:1061:57: fehlender binärer Operator vor Token »(«
    In file included from el.h:107,
                     from common.c:51,
                     from editline.c:4:
    sig.h:65: error: Syntaxfehler before '*' token
    sig.h:65: Warnung: data definition has no type or storage class
    In file included from common.c:51,
                     from editline.c:4:
    el.h:124: error: Syntaxfehler before "el_tty_t"
    el.h:124: Warnung: kein Semikolon am Ende von »struct« oder »union«
    el.h:133: error: Syntaxfehler before "el_signal"
    el.h:133: Warnung: data definition has no type or storage class
    el.h:135: error: Syntaxfehler before '}' token
    In file included from editline.c:4:
    common.c: In Funktion »ed_end_of_file«:
    common.c:63: error: dereferencing pointer to incomplete type
    common.c: In Funktion »ed_insert«:
    common.c:80: error: dereferencing pointer to incomplete type
    common.c:80: error: dereferencing pointer to incomplete type
    common.c:81: error: dereferencing pointer to incomplete type
    common.c:83: error: dereferencing pointer to incomplete type
    common.c:87: error: dereferencing pointer to incomplete type
    common.c:88: error: dereferencing pointer to incomplete type
    common.c:89: error: dereferencing pointer to incomplete type
    common.c:89: error: dereferencing pointer to incomplete type
    common.c:90: error: dereferencing pointer to incomplete type
    common.c:91: error: dereferencing pointer to incomplete type
    common.c:91: error: dereferencing pointer to incomplete type
    common.c:97: error: dereferencing pointer to incomplete type
    common.c:98: error: dereferencing pointer to incomplete type
    common.c:101: error: dereferencing pointer to incomplete type
    common.c:102: error: dereferencing pointer to incomplete type
    common.c:103: error: dereferencing pointer to incomplete type
    common.c:103: error: dereferencing pointer to incomplete type
    common.c:104: error: dereferencing pointer to incomplete type
    common.c:106: error: dereferencing pointer to incomplete type
    common.c:106: error: dereferencing pointer to incomplete type
    common.c:108: error: dereferencing pointer to incomplete type
    common.c:110: error: dereferencing pointer to incomplete type
    common.c:112: error: dereferencing pointer to incomplete type
    common.c:113: error: dereferencing pointer to incomplete type
    common.c:117: error: dereferencing pointer to incomplete type
    common.c: In Funktion »ed_delete_prev_word«:
    common.c:134: error: dereferencing pointer to incomplete type
    common.c:134: error: dereferencing pointer to incomplete type
    common.c:137: error: dereferencing pointer to incomplete type
    common.c:137: error: dereferencing pointer to incomplete type
    common.c:138: error: dereferencing pointer to incomplete type
    common.c:140: error: dereferencing pointer to incomplete type
    common.c:140: error: dereferencing pointer to incomplete type
    common.c:142: error: dereferencing pointer to incomplete type
    common.c:144: error: dereferencing pointer to incomplete type
    common.c:145: error: dereferencing pointer to incomplete type
    common.c:146: error: dereferencing pointer to incomplete type
    common.c:146: error: dereferencing pointer to incomplete type
    common.c:147: error: dereferencing pointer to incomplete type
    common.c:147: error: dereferencing pointer to incomplete type
    common.c: In Funktion »ed_delete_next_char«:
    common.c:167: error: dereferencing pointer to incomplete type
    common.c:167: error: dereferencing pointer to incomplete type
    common.c:169: error: dereferencing pointer to incomplete type
    common.c:170: error: dereferencing pointer to incomplete type
    common.c:170: error: dereferencing pointer to incomplete type
    common.c:182: error: dereferencing pointer to incomplete type
    common.c:188: error: dereferencing pointer to incomplete type
    common.c:188: error: dereferencing pointer to incomplete type
    common.c:189: error: dereferencing pointer to incomplete type
    common.c:194: error: dereferencing pointer to incomplete type
    common.c:195: error: dereferencing pointer to incomplete type
    common.c:195: error: dereferencing pointer to incomplete type
    common.c:196: error: dereferencing pointer to incomplete type
    common.c:196: error: dereferencing pointer to incomplete type
    common.c:198: error: dereferencing pointer to incomplete type
    common.c:198: error: dereferencing pointer to incomplete type
    common.c: In Funktion »ed_kill_line«:
    common.c:213: error: dereferencing pointer to incomplete type
    common.c:214: error: dereferencing pointer to incomplete type
    common.c:215: error: dereferencing pointer to incomplete type
    common.c:217: error: dereferencing pointer to incomplete type
    common.c:219: error: dereferencing pointer to incomplete type
    common.c:219: error: dereferencing pointer to incomplete type
    common.c: In Funktion »ed_move_to_end«:
    common.c:233: error: dereferencing pointer to incomplete type
    common.c:233: error: dereferencing pointer to incomplete type
    common.c:234: error: dereferencing pointer to incomplete type
    common.c:236: error: dereferencing pointer to incomplete type
    common.c:238: error: dereferencing pointer to incomplete type
    common.c: In Funktion »ed_move_to_beg«:
    common.c:256: error: dereferencing pointer to incomplete type
    common.c:256: error: dereferencing pointer to incomplete type
    common.c:258: error: dereferencing pointer to incomplete type
    common.c:260: error: dereferencing pointer to incomplete type
    common.c:261: error: dereferencing pointer to incomplete type
    common.c:262: error: dereferencing pointer to incomplete type
    common.c: In Funktion »ed_transpose_chars«:
    common.c:279: error: dereferencing pointer to incomplete type
    common.c:279: error: dereferencing pointer to incomplete type
    common.c:280: error: dereferencing pointer to incomplete type
    common.c:280: error: dereferencing pointer to incomplete type
    common.c:283: error: dereferencing pointer to incomplete type
    common.c:285: error: dereferencing pointer to incomplete type
    common.c:285: error: dereferencing pointer to incomplete type
    common.c:287: error: dereferencing pointer to incomplete type
    common.c:288: error: dereferencing pointer to incomplete type
    common.c:288: error: dereferencing pointer to incomplete type
    common.c:289: error: dereferencing pointer to incomplete type
    common.c: In Funktion »ed_next_char«:
    common.c:305: error: dereferencing pointer to incomplete type
    common.c:305: error: dereferencing pointer to incomplete type
    common.c:308: error: dereferencing pointer to incomplete type
    common.c:308: error: dereferencing pointer to incomplete type
    common.c:309: error: dereferencing pointer to incomplete type
    common.c:309: error: dereferencing pointer to incomplete type
    common.c:310: error: dereferencing pointer to incomplete type
    common.c:310: error: dereferencing pointer to incomplete type
    common.c:312: error: dereferencing pointer to incomplete type
    common.c:313: error: dereferencing pointer to incomplete type
    common.c: In Funktion »ed_prev_word«:
    common.c:330: error: dereferencing pointer to incomplete type
    common.c:330: error: dereferencing pointer to incomplete type
    common.c:333: error: dereferencing pointer to incomplete type
    common.c:333: error: dereferencing pointer to incomplete type
    common.c:334: error: dereferencing pointer to incomplete type
    common.c:335: error: dereferencing pointer to incomplete type
    common.c:338: error: dereferencing pointer to incomplete type
    common.c:339: error: dereferencing pointer to incomplete type
    common.c: In Funktion »ed_prev_char«:
    common.c:356: error: dereferencing pointer to incomplete type
    common.c:356: error: dereferencing pointer to incomplete type
    common.c:357: error: dereferencing pointer to incomplete type
    common.c:357: error: dereferencing pointer to incomplete type
    common.c:358: error: dereferencing pointer to incomplete type
    common.c:358: error: dereferencing pointer to incomplete type
    common.c:359: error: dereferencing pointer to incomplete type
    common.c:359: error: dereferencing pointer to incomplete type
    common.c:361: error: dereferencing pointer to incomplete type
    common.c:362: error: dereferencing pointer to incomplete type
    common.c: In Funktion »ed_digit«:
    common.c:403: error: dereferencing pointer to incomplete type
    common.c:405: error: dereferencing pointer to incomplete type
    common.c:406: error: dereferencing pointer to incomplete type
    common.c:408: error: dereferencing pointer to incomplete type
    common.c:410: error: dereferencing pointer to incomplete type
    common.c:411: error: dereferencing pointer to incomplete type
    common.c:415: error: dereferencing pointer to incomplete type
    common.c:415: error: dereferencing pointer to incomplete type
    common.c:420: error: dereferencing pointer to incomplete type
    common.c:421: error: dereferencing pointer to incomplete type
    common.c:421: error: dereferencing pointer to incomplete type
    common.c:422: error: dereferencing pointer to incomplete type
    common.c:423: error: dereferencing pointer to incomplete type
    common.c:423: error: dereferencing pointer to incomplete type
    common.c:428: error: dereferencing pointer to incomplete type
    common.c:429: error: dereferencing pointer to incomplete type
    common.c: In Funktion »ed_argument_digit«:
    common.c:447: error: dereferencing pointer to incomplete type
    common.c:448: error: dereferencing pointer to incomplete type
    common.c:450: error: dereferencing pointer to incomplete type
    common.c:450: error: dereferencing pointer to incomplete type
    common.c:453: error: dereferencing pointer to incomplete type
    common.c:454: error: dereferencing pointer to incomplete type
    common.c: In Funktion »ed_newline«:
    common.c:580: error: dereferencing pointer to incomplete type
    common.c:581: error: dereferencing pointer to incomplete type
    common.c:582: error: dereferencing pointer to incomplete type
    common.c:583: error: dereferencing pointer to incomplete type
    common.c:583: error: dereferencing pointer to incomplete type
    common.c: In Funktion »ed_delete_prev_char«:
    common.c:597: error: dereferencing pointer to incomplete type
    common.c:597: error: dereferencing pointer to incomplete type
    common.c:600: error: dereferencing pointer to incomplete type
    common.c:601: error: dereferencing pointer to incomplete type
    common.c:601: error: dereferencing pointer to incomplete type
    common.c:602: error: dereferencing pointer to incomplete type
    common.c:602: error: dereferencing pointer to incomplete type
    common.c:603: error: dereferencing pointer to incomplete type
    common.c:603: error: dereferencing pointer to incomplete type
    common.c: In Funktion »ed_prev_history«:
    common.c:673: error: dereferencing pointer to incomplete type
    common.c:674: error: dereferencing pointer to incomplete type
    common.c:676: error: dereferencing pointer to incomplete type
    common.c:678: error: dereferencing pointer to incomplete type
    common.c:678: error: dereferencing pointer to incomplete type
    common.c:678: error: dereferencing pointer to incomplete type
    common.c:678: error: dereferencing pointer to incomplete type
    common.c:678: error: dereferencing pointer to incomplete type
    common.c:678: error: dereferencing pointer to incomplete type
    common.c:678: error: dereferencing pointer to incomplete type
    common.c:678: error: dereferencing pointer to incomplete type
    common.c:680: error: dereferencing pointer to incomplete type
    common.c:680: error: dereferencing pointer to incomplete type
    common.c:681: error: dereferencing pointer to incomplete type
    common.c:681: error: dereferencing pointer to incomplete type
    common.c:683: error: dereferencing pointer to incomplete type
    common.c:683: error: dereferencing pointer to incomplete type
    common.c: In Funktion »ed_next_history«:
    common.c:707: error: dereferencing pointer to incomplete type
    common.c:708: error: dereferencing pointer to incomplete type
    common.c:710: error: dereferencing pointer to incomplete type
    common.c:710: error: dereferencing pointer to incomplete type
    common.c:712: error: dereferencing pointer to incomplete type
    common.c:713: error: dereferencing pointer to incomplete type
    common.c: In Funktion »ed_search_prev_history«:
    common.c:732: error: dereferencing pointer to incomplete type
    common.c:733: error: dereferencing pointer to incomplete type
    common.c:734: error: dereferencing pointer to incomplete type
    common.c:735: error: dereferencing pointer to incomplete type
    common.c:740: error: dereferencing pointer to incomplete type
    common.c:743: error: dereferencing pointer to incomplete type
    common.c:744: error: dereferencing pointer to incomplete type
    common.c:744: error: dereferencing pointer to incomplete type
    common.c:744: error: dereferencing pointer to incomplete type
    common.c:744: error: dereferencing pointer to incomplete type
    common.c:744: error: dereferencing pointer to incomplete type
    common.c:744: error: dereferencing pointer to incomplete type
    common.c:744: error: dereferencing pointer to incomplete type
    common.c:744: error: dereferencing pointer to incomplete type
    common.c:746: error: dereferencing pointer to incomplete type
    common.c:746: error: dereferencing pointer to incomplete type
    common.c:747: error: dereferencing pointer to incomplete type
    common.c:747: error: dereferencing pointer to incomplete type
    common.c:749: error: dereferencing pointer to incomplete type
    common.c:752: error: dereferencing pointer to incomplete type
    common.c:752: error: dereferencing pointer to incomplete type
    common.c:752: error: dereferencing pointer to incomplete type
    common.c:752: error: dereferencing pointer to incomplete type
    common.c:758: error: dereferencing pointer to incomplete type
    common.c:759: error: dereferencing pointer to incomplete type
    common.c:759: error: dereferencing pointer to incomplete type
    common.c:759: error: dereferencing pointer to incomplete type
    common.c:759: error: dereferencing pointer to incomplete type
    common.c:765: error: dereferencing pointer to incomplete type
    common.c:765: error: dereferencing pointer to incomplete type
    common.c:765: error: dereferencing pointer to incomplete type
    common.c:765: error: dereferencing pointer to incomplete type
    common.c:765: error: dereferencing pointer to incomplete type
    common.c:765: error: dereferencing pointer to incomplete type
    common.c:765: error: dereferencing pointer to incomplete type
    common.c:765: error: dereferencing pointer to incomplete type
    common.c:765: error: dereferencing pointer to incomplete type
    common.c:765: error: dereferencing pointer to incomplete type
    common.c:765: error: dereferencing pointer to incomplete type
    common.c:765: error: dereferencing pointer to incomplete type
    common.c:765: error: dereferencing pointer to incomplete type
    common.c:765: error: dereferencing pointer to incomplete type
    common.c:765: error: dereferencing pointer to incomplete type
    common.c:765: error: dereferencing pointer to incomplete type
    common.c:765: error: dereferencing pointer to incomplete type
    common.c:765: error: dereferencing pointer to incomplete type
    common.c:765: error: dereferencing pointer to incomplete type
    common.c:765: error: dereferencing pointer to incomplete type
    common.c:765: error: dereferencing pointer to incomplete type
    common.c:765: error: dereferencing pointer to incomplete type
    common.c:765: error: dereferencing pointer to incomplete type
    common.c:765: error: dereferencing pointer to incomplete type
    common.c:765: error: dereferencing pointer to incomplete type
    common.c:765: error: dereferencing pointer to incomplete type
    common.c:765: error: dereferencing pointer to incomplete type
    common.c:765: error: dereferencing pointer to incomplete type
    common.c:765: error: dereferencing pointer to incomplete type
    common.c:765: error: dereferencing pointer to incomplete type
    common.c:765: error: dereferencing pointer to incomplete type
    common.c:765: error: dereferencing pointer to incomplete type
    common.c:765: error: dereferencing pointer to incomplete type
    common.c:765: error: dereferencing pointer to incomplete type
    common.c:765: error: dereferencing pointer to incomplete type
    common.c:765: error: dereferencing pointer to incomplete type
    common.c:765: error: dereferencing pointer to incomplete type
    common.c:767: error: dereferencing pointer to incomplete type
    common.c:767: error: dereferencing pointer to incomplete type
    common.c:773: error: dereferencing pointer to incomplete type
    common.c:773: error: dereferencing pointer to incomplete type
    common.c:773: error: dereferencing pointer to incomplete type
    common.c:773: error: dereferencing pointer to incomplete type
    common.c:782: error: dereferencing pointer to incomplete type
    common.c: In Funktion »ed_search_next_history«:
    common.c:800: error: dereferencing pointer to incomplete type
    common.c:801: error: dereferencing pointer to incomplete type
    common.c:802: error: dereferencing pointer to incomplete type
    common.c:804: error: dereferencing pointer to incomplete type
    common.c:807: error: dereferencing pointer to incomplete type
    common.c:810: error: dereferencing pointer to incomplete type
    common.c:810: error: dereferencing pointer to incomplete type
    common.c:810: error: dereferencing pointer to incomplete type
    common.c:810: error: dereferencing pointer to incomplete type
    common.c:816: error: dereferencing pointer to incomplete type
    common.c:820: error: dereferencing pointer to incomplete type
    common.c:820: error: dereferencing pointer to incomplete type
    common.c:820: error: dereferencing pointer to incomplete type
    common.c:820: error: dereferencing pointer to incomplete type
    common.c:820: error: dereferencing pointer to incomplete type
    common.c:820: error: dereferencing pointer to incomplete type
    common.c:820: error: dereferencing pointer to incomplete type
    common.c:820: error: dereferencing pointer to incomplete type
    common.c:820: error: dereferencing pointer to incomplete type
    common.c:820: error: dereferencing pointer to incomplete type
    common.c:820: error: dereferencing pointer to incomplete type
    common.c:820: error: dereferencing pointer to incomplete type
    common.c:820: error: dereferencing pointer to incomplete type
    common.c:820: error: dereferencing pointer to incomplete type
    common.c:820: error: dereferencing pointer to incomplete type
    common.c:820: error: dereferencing pointer to incomplete type
    common.c:820: error: dereferencing pointer to incomplete type
    common.c:820: error: dereferencing pointer to incomplete type
    common.c:820: error: dereferencing pointer to incomplete type
    common.c:820: error: dereferencing pointer to incomplete type
    common.c:820: error: dereferencing pointer to incomplete type
    common.c:820: error: dereferencing pointer to incomplete type
    common.c:820: error: dereferencing pointer to incomplete type
    common.c:820: error: dereferencing pointer to incomplete type
    common.c:820: error: dereferencing pointer to incomplete type
    common.c:820: error: dereferencing pointer to incomplete type
    common.c:820: error: dereferencing pointer to incomplete type
    common.c:820: error: dereferencing pointer to incomplete type
    common.c:820: error: dereferencing pointer to incomplete type
    common.c:820: error: dereferencing pointer to incomplete type
    common.c:820: error: dereferencing pointer to incomplete type
    common.c:820: error: dereferencing pointer to incomplete type
    common.c:820: error: dereferencing pointer to incomplete type
    common.c:820: error: dereferencing pointer to incomplete type
    common.c:820: error: dereferencing pointer to incomplete type
    common.c:820: error: dereferencing pointer to incomplete type
    common.c:820: error: dereferencing pointer to incomplete type
    common.c:822: error: dereferencing pointer to incomplete type
    common.c:822: error: dereferencing pointer to incomplete type
    common.c:825: error: dereferencing pointer to incomplete type
    common.c:825: error: dereferencing pointer to incomplete type
    common.c:825: error: dereferencing pointer to incomplete type
    common.c:825: error: dereferencing pointer to incomplete type
    common.c:829: error: dereferencing pointer to incomplete type
    common.c:836: error: dereferencing pointer to incomplete type
    common.c: In Funktion »ed_prev_line«:
    common.c:856: error: dereferencing pointer to incomplete type
    common.c:859: error: dereferencing pointer to incomplete type
    common.c:860: error: dereferencing pointer to incomplete type
    common.c:863: error: dereferencing pointer to incomplete type
    common.c:869: error: dereferencing pointer to incomplete type
    common.c:876: error: dereferencing pointer to incomplete type
    common.c:880: error: dereferencing pointer to incomplete type
    common.c: In Funktion »ed_next_line«:
    common.c:899: error: dereferencing pointer to incomplete type
    common.c:899: error: dereferencing pointer to incomplete type
    common.c:900: error: dereferencing pointer to incomplete type
    common.c:903: error: dereferencing pointer to incomplete type
    common.c:910: error: dereferencing pointer to incomplete type
    common.c:914: error: dereferencing pointer to incomplete type
    common.c: In Funktion »ed_command«:
    common.c:930: error: dereferencing pointer to incomplete type
    common.c:931: error: dereferencing pointer to incomplete type
    common.c:931: error: dereferencing pointer to incomplete type
    common.c:932: error: dereferencing pointer to incomplete type
    common.c:932: error: dereferencing pointer to incomplete type
    common.c:935: error: dereferencing pointer to incomplete type
    common.c:936: error: dereferencing pointer to incomplete type
    common.c:937: error: dereferencing pointer to incomplete type
    common.c:943: error: dereferencing pointer to incomplete type
    common.c:944: error: dereferencing pointer to incomplete type
    common.c:944: error: dereferencing pointer to incomplete type
    common.c:945: error: dereferencing pointer to incomplete type
    common.c:945: error: dereferencing pointer to incomplete type
    In file included from editline.c:5:
    emacs.c: In Funktion »em_delete_or_list«:
    emacs.c:62: error: dereferencing pointer to incomplete type
    emacs.c:62: error: dereferencing pointer to incomplete type
    emacs.c:64: error: dereferencing pointer to incomplete type
    emacs.c:64: error: dereferencing pointer to incomplete type
    emacs.c:78: error: dereferencing pointer to incomplete type
    emacs.c:79: error: dereferencing pointer to incomplete type
    emacs.c:79: error: dereferencing pointer to incomplete type
    emacs.c:80: error: dereferencing pointer to incomplete type
    emacs.c:80: error: dereferencing pointer to incomplete type
    emacs.c: In Funktion »em_delete_next_word«:
    emacs.c:97: error: dereferencing pointer to incomplete type
    emacs.c:97: error: dereferencing pointer to incomplete type
    emacs.c:100: error: dereferencing pointer to incomplete type
    emacs.c:100: error: dereferencing pointer to incomplete type
    emacs.c:101: error: dereferencing pointer to incomplete type
    emacs.c:103: error: dereferencing pointer to incomplete type
    emacs.c:103: error: dereferencing pointer to incomplete type
    emacs.c:106: error: dereferencing pointer to incomplete type
    emacs.c:108: error: dereferencing pointer to incomplete type
    emacs.c:109: error: dereferencing pointer to incomplete type
    emacs.c:109: error: dereferencing pointer to incomplete type
    emacs.c:110: error: dereferencing pointer to incomplete type
    emacs.c:110: error: dereferencing pointer to incomplete type
    emacs.c: In Funktion »em_yank«:
    emacs.c:126: error: dereferencing pointer to incomplete type
    emacs.c:126: error: dereferencing pointer to incomplete type
    emacs.c:131: error: dereferencing pointer to incomplete type
    emacs.c:132: error: dereferencing pointer to incomplete type
    emacs.c:132: error: dereferencing pointer to incomplete type
    emacs.c:133: error: dereferencing pointer to incomplete type
    emacs.c:136: error: dereferencing pointer to incomplete type
    emacs.c:136: error: dereferencing pointer to incomplete type
    emacs.c:137: error: dereferencing pointer to incomplete type
    emacs.c:140: error: dereferencing pointer to incomplete type
    emacs.c:140: error: dereferencing pointer to incomplete type
    emacs.c:142: error: dereferencing pointer to incomplete type
    emacs.c:142: error: dereferencing pointer to incomplete type
    emacs.c:146: error: dereferencing pointer to incomplete type
    emacs.c:147: error: dereferencing pointer to incomplete type
    emacs.c: In Funktion »em_kill_line«:
    emacs.c:163: error: dereferencing pointer to incomplete type
    emacs.c:164: error: dereferencing pointer to incomplete type
    emacs.c:165: error: dereferencing pointer to incomplete type
    emacs.c:167: error: dereferencing pointer to incomplete type
    emacs.c:169: error: dereferencing pointer to incomplete type
    emacs.c:169: error: dereferencing pointer to incomplete type
    emacs.c:170: error: dereferencing pointer to incomplete type
    emacs.c:170: error: dereferencing pointer to incomplete type
    emacs.c: In Funktion »em_kill_region«:
    emacs.c:185: error: dereferencing pointer to incomplete type
    emacs.c:188: error: dereferencing pointer to incomplete type
    emacs.c:188: error: dereferencing pointer to incomplete type
    emacs.c:189: error: dereferencing pointer to incomplete type
    emacs.c:190: error: dereferencing pointer to incomplete type
    emacs.c:191: error: dereferencing pointer to incomplete type
    emacs.c:193: error: dereferencing pointer to incomplete type
    emacs.c:194: error: dereferencing pointer to incomplete type
    emacs.c:196: error: dereferencing pointer to incomplete type
    emacs.c:197: error: dereferencing pointer to incomplete type
    emacs.c:198: error: dereferencing pointer to incomplete type
    emacs.c:200: error: dereferencing pointer to incomplete type
    emacs.c:201: error: dereferencing pointer to incomplete type
    emacs.c:202: error: dereferencing pointer to incomplete type
    emacs.c:202: error: dereferencing pointer to incomplete type
    emacs.c: In Funktion »em_copy_region«:
    emacs.c:218: error: dereferencing pointer to incomplete type
    emacs.c:221: error: dereferencing pointer to incomplete type
    emacs.c:221: error: dereferencing pointer to incomplete type
    emacs.c:222: error: dereferencing pointer to incomplete type
    emacs.c:223: error: dereferencing pointer to incomplete type
    emacs.c:224: error: dereferencing pointer to incomplete type
    emacs.c:226: error: dereferencing pointer to incomplete type
    emacs.c:228: error: dereferencing pointer to incomplete type
    emacs.c:229: error: dereferencing pointer to incomplete type
    emacs.c:230: error: dereferencing pointer to incomplete type
    emacs.c:232: error: dereferencing pointer to incomplete type
    emacs.c: In Funktion »em_gosmacs_traspose«:
    emacs.c:246: error: dereferencing pointer to incomplete type
    emacs.c:246: error: dereferencing pointer to incomplete type
    emacs.c:248: error: dereferencing pointer to incomplete type
    emacs.c:249: error: dereferencing pointer to incomplete type
    emacs.c:249: error: dereferencing pointer to incomplete type
    emacs.c:250: error: dereferencing pointer to incomplete type
    emacs.c: In Funktion »em_next_word«:
    emacs.c:265: error: dereferencing pointer to incomplete type
    emacs.c:265: error: dereferencing pointer to incomplete type
    emacs.c:268: error: dereferencing pointer to incomplete type
    emacs.c:268: error: dereferencing pointer to incomplete type
    emacs.c:269: error: dereferencing pointer to incomplete type
    emacs.c:270: error: dereferencing pointer to incomplete type
    emacs.c:273: error: dereferencing pointer to incomplete type
    emacs.c:274: error: dereferencing pointer to incomplete type
    emacs.c: In Funktion »em_upper_case«:
    emacs.c:292: error: dereferencing pointer to incomplete type
    emacs.c:292: error: dereferencing pointer to incomplete type
    emacs.c:293: error: dereferencing pointer to incomplete type
    emacs.c:295: error: dereferencing pointer to incomplete type
    emacs.c:299: error: dereferencing pointer to incomplete type
    emacs.c:300: error: dereferencing pointer to incomplete type
    emacs.c:300: error: dereferencing pointer to incomplete type
    emacs.c:301: error: dereferencing pointer to incomplete type
    emacs.c:301: error: dereferencing pointer to incomplete type
    emacs.c: In Funktion »em_capitol_case«:
    emacs.c:316: error: dereferencing pointer to incomplete type
    emacs.c:316: error: dereferencing pointer to incomplete type
    emacs.c:317: error: dereferencing pointer to incomplete type
    emacs.c:319: error: dereferencing pointer to incomplete type
    emacs.c:331: error: dereferencing pointer to incomplete type
    emacs.c:332: error: dereferencing pointer to incomplete type
    emacs.c:332: error: dereferencing pointer to incomplete type
    emacs.c:333: error: dereferencing pointer to incomplete type
    emacs.c:333: error: dereferencing pointer to incomplete type
    emacs.c: In Funktion »em_lower_case«:
    emacs.c:348: error: dereferencing pointer to incomplete type
    emacs.c:348: error: dereferencing pointer to incomplete type
    emacs.c:349: error: dereferencing pointer to incomplete type
    emacs.c:351: error: dereferencing pointer to incomplete type
    emacs.c:355: error: dereferencing pointer to incomplete type
    emacs.c:356: error: dereferencing pointer to incomplete type
    emacs.c:356: error: dereferencing pointer to incomplete type
    emacs.c:357: error: dereferencing pointer to incomplete type
    emacs.c:357: error: dereferencing pointer to incomplete type
    emacs.c: In Funktion »em_set_mark«:
    emacs.c:371: error: dereferencing pointer to incomplete type
    emacs.c:371: error: dereferencing pointer to incomplete type
    emacs.c: In Funktion »em_exchange_mark«:
    emacs.c:386: error: dereferencing pointer to incomplete type
    emacs.c:387: error: dereferencing pointer to incomplete type
    emacs.c:387: error: dereferencing pointer to incomplete type
    emacs.c:388: error: dereferencing pointer to incomplete type
    emacs.c: In Funktion »em_universal_argument«:
    emacs.c:402: error: dereferencing pointer to incomplete type
    emacs.c:404: error: dereferencing pointer to incomplete type
    emacs.c:405: error: dereferencing pointer to incomplete type
    emacs.c: In Funktion »em_meta_next«:
    emacs.c:419: error: dereferencing pointer to incomplete type
    emacs.c: In Funktion »em_toggle_overwrite«:
    emacs.c:432: error: dereferencing pointer to incomplete type
    emacs.c:432: error: dereferencing pointer to incomplete type
    emacs.c: In Funktion »em_copy_prev_word«:
    emacs.c:447: error: dereferencing pointer to incomplete type
    emacs.c:447: error: dereferencing pointer to incomplete type
    emacs.c:450: error: dereferencing pointer to incomplete type
    emacs.c:452: error: dereferencing pointer to incomplete type
    emacs.c:452: error: dereferencing pointer to incomplete type
    emacs.c:453: error: dereferencing pointer to incomplete type
    emacs.c:456: error: dereferencing pointer to incomplete type
    emacs.c:459: error: dereferencing pointer to incomplete type
    emacs.c: In Funktion »em_inc_search_next«:
    emacs.c:473: error: dereferencing pointer to incomplete type
    emacs.c: In Funktion »em_inc_search_prev«:
    emacs.c:486: error: dereferencing pointer to incomplete type
    In file included from editline.c:6:
    vi.c: In Funktion »cv_action«:
    vi.c:64: error: dereferencing pointer to incomplete type
    vi.c:65: error: dereferencing pointer to incomplete type
    vi.c:66: error: dereferencing pointer to incomplete type
    vi.c:68: error: dereferencing pointer to incomplete type
    vi.c:69: error: dereferencing pointer to incomplete type
    vi.c:70: error: dereferencing pointer to incomplete type
    vi.c:71: error: dereferencing pointer to incomplete type
    vi.c:71: error: dereferencing pointer to incomplete type
    vi.c:73: error: dereferencing pointer to incomplete type
    vi.c:76: error: dereferencing pointer to incomplete type
    vi.c:77: error: dereferencing pointer to incomplete type
    vi.c:77: error: dereferencing pointer to incomplete type
    vi.c:78: error: dereferencing pointer to incomplete type
    vi.c:78: error: dereferencing pointer to incomplete type
    vi.c:79: error: dereferencing pointer to incomplete type
    vi.c:79: error: dereferencing pointer to incomplete type
    vi.c:81: error: dereferencing pointer to incomplete type
    vi.c:81: error: dereferencing pointer to incomplete type
    vi.c:85: error: dereferencing pointer to incomplete type
    vi.c:85: error: dereferencing pointer to incomplete type
    vi.c:86: error: dereferencing pointer to incomplete type
    vi.c: In Funktion »cv_paste«:
    vi.c:114: error: dereferencing pointer to incomplete type
    vi.c:123: error: dereferencing pointer to incomplete type
    vi.c:123: error: dereferencing pointer to incomplete type
    vi.c:124: error: dereferencing pointer to incomplete type
    vi.c:125: error: dereferencing pointer to incomplete type
    vi.c:128: error: dereferencing pointer to incomplete type
    vi.c:128: error: dereferencing pointer to incomplete type
    vi.c: In Funktion »vi_prev_space_word«:
    vi.c:170: error: dereferencing pointer to incomplete type
    vi.c:170: error: dereferencing pointer to incomplete type
    vi.c:173: error: dereferencing pointer to incomplete type
    vi.c:173: error: dereferencing pointer to incomplete type
    vi.c:174: error: dereferencing pointer to incomplete type
    vi.c:175: error: dereferencing pointer to incomplete type
    vi.c:178: error: dereferencing pointer to incomplete type
    vi.c: In Funktion »vi_prev_word«:
    vi.c:195: error: dereferencing pointer to incomplete type
    vi.c:195: error: dereferencing pointer to incomplete type
    vi.c:198: error: dereferencing pointer to incomplete type
    vi.c:198: error: dereferencing pointer to incomplete type
    vi.c:199: error: dereferencing pointer to incomplete type
    vi.c:200: error: dereferencing pointer to incomplete type
    vi.c:203: error: dereferencing pointer to incomplete type
    vi.c: In Funktion »vi_next_space_word«:
    vi.c:220: error: dereferencing pointer to incomplete type
    vi.c:220: error: dereferencing pointer to incomplete type
    vi.c:223: error: dereferencing pointer to incomplete type
    vi.c:223: error: dereferencing pointer to incomplete type
    vi.c:224: error: dereferencing pointer to incomplete type
    vi.c:225: error: dereferencing pointer to incomplete type
    vi.c:228: error: dereferencing pointer to incomplete type
    vi.c:229: error: dereferencing pointer to incomplete type
    vi.c: In Funktion »vi_next_word«:
    vi.c:246: error: dereferencing pointer to incomplete type
    vi.c:246: error: dereferencing pointer to incomplete type
    vi.c:249: error: dereferencing pointer to incomplete type
    vi.c:249: error: dereferencing pointer to incomplete type
    vi.c:250: error: dereferencing pointer to incomplete type
    vi.c:251: error: dereferencing pointer to incomplete type
    vi.c:254: error: dereferencing pointer to incomplete type
    vi.c:255: error: dereferencing pointer to incomplete type
    vi.c: In Funktion »vi_change_case«:
    vi.c:271: error: dereferencing pointer to incomplete type
    vi.c:271: error: dereferencing pointer to incomplete type
    vi.c:272: error: dereferencing pointer to incomplete type
    vi.c:274: error: dereferencing pointer to incomplete type
    vi.c:276: error: dereferencing pointer to incomplete type
    vi.c:278: error: dereferencing pointer to incomplete type
    vi.c: In Funktion »vi_insert_at_bol«:
    vi.c:312: error: dereferencing pointer to incomplete type
    vi.c:312: error: dereferencing pointer to incomplete type
    vi.c:313: error: dereferencing pointer to incomplete type
    vi.c:313: error: dereferencing pointer to incomplete type
    vi.c:315: error: dereferencing pointer to incomplete type
    vi.c:315: error: dereferencing pointer to incomplete type
    vi.c:316: error: dereferencing pointer to incomplete type
    vi.c:318: error: dereferencing pointer to incomplete type
    vi.c:318: error: dereferencing pointer to incomplete type
    vi.c: In Funktion »vi_replace_char«:
    vi.c:332: error: dereferencing pointer to incomplete type
    vi.c:332: error: dereferencing pointer to incomplete type
    vi.c:333: error: dereferencing pointer to incomplete type
    vi.c:334: error: dereferencing pointer to incomplete type
    vi.c:335: error: dereferencing pointer to incomplete type
    vi.c:335: error: dereferencing pointer to incomplete type
    vi.c:336: error: dereferencing pointer to incomplete type
    vi.c:337: error: dereferencing pointer to incomplete type
    vi.c: In Funktion »vi_replace_mode«:
    vi.c:351: error: dereferencing pointer to incomplete type
    vi.c:351: error: dereferencing pointer to incomplete type
    vi.c:352: error: dereferencing pointer to incomplete type
    vi.c:353: error: dereferencing pointer to incomplete type
    vi.c:354: error: dereferencing pointer to incomplete type
    vi.c:354: error: dereferencing pointer to incomplete type
    vi.c:355: error: dereferencing pointer to incomplete type
    vi.c:356: error: dereferencing pointer to incomplete type
    vi.c: In Funktion »vi_substitute_char«:
    vi.c:370: error: dereferencing pointer to incomplete type
    vi.c:371: error: dereferencing pointer to incomplete type
    vi.c:371: error: dereferencing pointer to incomplete type
    vi.c: In Funktion »vi_substitute_line«:
    vi.c:386: error: dereferencing pointer to incomplete type
    vi.c:386: error: dereferencing pointer to incomplete type
    vi.c: In Funktion »vi_change_to_eol«:
    vi.c:401: error: dereferencing pointer to incomplete type
    vi.c:401: error: dereferencing pointer to incomplete type
    vi.c: In Funktion »vi_insert«:
    vi.c:415: error: dereferencing pointer to incomplete type
    vi.c:415: error: dereferencing pointer to incomplete type
    vi.c:417: error: dereferencing pointer to incomplete type
    vi.c:417: error: dereferencing pointer to incomplete type
    vi.c:418: error: dereferencing pointer to incomplete type
    vi.c:418: error: dereferencing pointer to incomplete type
    vi.c:419: error: dereferencing pointer to incomplete type
    vi.c: In Funktion »vi_add«:
    vi.c:435: error: dereferencing pointer to incomplete type
    vi.c:435: error: dereferencing pointer to incomplete type
    vi.c:436: error: dereferencing pointer to incomplete type
    vi.c:436: error: dereferencing pointer to incomplete type
    vi.c:437: error: dereferencing pointer to incomplete type
    vi.c:438: error: dereferencing pointer to incomplete type
    vi.c:438: error: dereferencing pointer to incomplete type
    vi.c:439: error: dereferencing pointer to incomplete type
    vi.c:439: error: dereferencing pointer to incomplete type
    vi.c:444: error: dereferencing pointer to incomplete type
    vi.c:444: error: dereferencing pointer to incomplete type
    vi.c:445: error: dereferencing pointer to incomplete type
    vi.c:445: error: dereferencing pointer to incomplete type
    vi.c:446: error: dereferencing pointer to incomplete type
    vi.c: In Funktion »vi_add_at_eol«:
    vi.c:461: error: dereferencing pointer to incomplete type
    vi.c:461: error: dereferencing pointer to incomplete type
    vi.c:462: error: dereferencing pointer to incomplete type
    vi.c:462: error: dereferencing pointer to incomplete type
    vi.c:465: error: dereferencing pointer to incomplete type
    vi.c:465: error: dereferencing pointer to incomplete type
    vi.c:466: error: dereferencing pointer to incomplete type
    vi.c:466: error: dereferencing pointer to incomplete type
    vi.c:467: error: dereferencing pointer to incomplete type
    vi.c: In Funktion »vi_end_word«:
    vi.c:494: error: dereferencing pointer to incomplete type
    vi.c:494: error: dereferencing pointer to incomplete type
    vi.c:497: error: dereferencing pointer to incomplete type
    vi.c:497: error: dereferencing pointer to incomplete type
    vi.c:498: error: dereferencing pointer to incomplete type
    vi.c:498: error: dereferencing pointer to incomplete type
    vi.c:500: error: dereferencing pointer to incomplete type
    vi.c:501: error: dereferencing pointer to incomplete type
    vi.c: In Funktion »vi_to_end_word«:
    vi.c:518: error: dereferencing pointer to incomplete type
    vi.c:518: error: dereferencing pointer to incomplete type
    vi.c:521: error: dereferencing pointer to incomplete type
    vi.c:521: error: dereferencing pointer to incomplete type
    vi.c:522: error: dereferencing pointer to incomplete type
    vi.c:522: error: dereferencing pointer to incomplete type
    vi.c:524: error: dereferencing pointer to incomplete type
    vi.c:525: error: dereferencing pointer to incomplete type
    vi.c: In Funktion »vi_undo«:
    vi.c:544: error: dereferencing pointer to incomplete type
    vi.c:556: error: dereferencing pointer to incomplete type
    vi.c:559: error: dereferencing pointer to incomplete type
    vi.c:560: error: dereferencing pointer to incomplete type
    vi.c:581: error: dereferencing pointer to incomplete type
    vi.c:583: error: dereferencing pointer to incomplete type
    vi.c:590: error: dereferencing pointer to incomplete type
    vi.c:594: error: dereferencing pointer to incomplete type
    vi.c:596: error: dereferencing pointer to incomplete type
    vi.c:606: error: dereferencing pointer to incomplete type
    vi.c:618: error: dereferencing pointer to incomplete type
    vi.c:619: error: dereferencing pointer to incomplete type
    vi.c:619: error: dereferencing pointer to incomplete type
    vi.c: In Funktion »vi_command_mode«:
    vi.c:651: error: dereferencing pointer to incomplete type
    vi.c:652: error: dereferencing pointer to incomplete type
    vi.c:653: error: dereferencing pointer to incomplete type
    vi.c:655: error: dereferencing pointer to incomplete type
    vi.c:656: error: dereferencing pointer to incomplete type
    vi.c:656: error: dereferencing pointer to incomplete type
    vi.c:659: error: dereferencing pointer to incomplete type
    vi.c:660: error: dereferencing pointer to incomplete type
    vi.c:661: error: dereferencing pointer to incomplete type
    vi.c:663: error: dereferencing pointer to incomplete type
    vi.c:665: error: dereferencing pointer to incomplete type
    vi.c:666: error: dereferencing pointer to incomplete type
    vi.c:666: error: dereferencing pointer to incomplete type
    vi.c:668: error: dereferencing pointer to incomplete type
    vi.c:668: error: dereferencing pointer to incomplete type
    vi.c:669: error: dereferencing pointer to incomplete type
    vi.c: In Funktion »vi_zero«:
    vi.c:683: error: dereferencing pointer to incomplete type
    vi.c:684: error: dereferencing pointer to incomplete type
    vi.c:686: error: dereferencing pointer to incomplete type
    vi.c:687: error: dereferencing pointer to incomplete type
    vi.c:690: error: dereferencing pointer to incomplete type
    vi.c:690: error: dereferencing pointer to incomplete type
    vi.c:691: error: dereferencing pointer to incomplete type
    vi.c: In Funktion »vi_delete_prev_char«:
    vi.c:709: error: dereferencing pointer to incomplete type
    vi.c:712: error: dereferencing pointer to incomplete type
    vi.c:713: error: dereferencing pointer to incomplete type
    vi.c:713: error: dereferencing pointer to incomplete type
    vi.c:716: error: dereferencing pointer to incomplete type
    vi.c:717: error: dereferencing pointer to incomplete type
    vi.c:717: error: dereferencing pointer to incomplete type
    vi.c: In Funktion »vi_kill_line_prev«:
    vi.c:759: error: dereferencing pointer to incomplete type
    vi.c:760: error: dereferencing pointer to incomplete type
    vi.c:761: error: dereferencing pointer to incomplete type
    vi.c:763: error: dereferencing pointer to incomplete type
    vi.c:764: error: dereferencing pointer to incomplete type
    vi.c:764: error: dereferencing pointer to incomplete type
    vi.c:765: error: dereferencing pointer to incomplete type
    vi.c:765: error: dereferencing pointer to incomplete type
    vi.c: In Funktion »vi_repeat_search_next«:
    vi.c:805: error: dereferencing pointer to incomplete type
    vi.c:808: error: dereferencing pointer to incomplete type
    vi.c: In Funktion »vi_repeat_search_prev«:
    vi.c:821: error: dereferencing pointer to incomplete type
    vi.c:825: error: dereferencing pointer to incomplete type
    vi.c: In Funktion »vi_next_char«:
    vi.c:843: error: dereferencing pointer to incomplete type
    vi.c:844: error: dereferencing pointer to incomplete type
    vi.c:846: error: dereferencing pointer to incomplete type
    vi.c: In Funktion »vi_prev_char«:
    vi.c:864: error: dereferencing pointer to incomplete type
    vi.c:865: error: dereferencing pointer to incomplete type
    vi.c:867: error: dereferencing pointer to incomplete type
    vi.c: In Funktion »vi_to_next_char«:
    vi.c:884: error: dereferencing pointer to incomplete type
    vi.c: In Funktion »vi_to_prev_char«:
    vi.c:902: error: dereferencing pointer to incomplete type
    vi.c: In Funktion »vi_repeat_next_char«:
    vi.c:915: error: dereferencing pointer to incomplete type
    vi.c:918: error: dereferencing pointer to incomplete type
    vi.c:919: error: dereferencing pointer to incomplete type
    vi.c:920: error: dereferencing pointer to incomplete type
    vi.c:921: error: dereferencing pointer to incomplete type
    vi.c:922: error: dereferencing pointer to incomplete type
    vi.c: In Funktion »vi_repeat_prev_char«:
    vi.c:935: error: dereferencing pointer to incomplete type
    vi.c:938: error: dereferencing pointer to incomplete type
    vi.c:939: error: dereferencing pointer to incomplete type
    vi.c:939: error: dereferencing pointer to incomplete type
    vi.c:940: error: dereferencing pointer to incomplete type
    vi.c:940: error: dereferencing pointer to incomplete type
    In file included from editline.c:7:
    chared.c: In Funktion »cv_undo«:
    chared.c:63: error: dereferencing pointer to incomplete type
    chared.c: In Funktion »c_insert«:
    chared.c:83: error: dereferencing pointer to incomplete type
    chared.c:83: error: dereferencing pointer to incomplete type
    chared.c:86: error: dereferencing pointer to incomplete type
    chared.c:86: error: dereferencing pointer to incomplete type
    chared.c:88: error: dereferencing pointer to incomplete type
    chared.c:88: error: dereferencing pointer to incomplete type
    chared.c:91: error: dereferencing pointer to incomplete type
    chared.c: In Funktion »c_delafter«:
    chared.c:102: error: dereferencing pointer to incomplete type
    chared.c:102: error: dereferencing pointer to incomplete type
    chared.c:103: error: dereferencing pointer to incomplete type
    chared.c:103: error: dereferencing pointer to incomplete type
    chared.c:108: error: dereferencing pointer to incomplete type
    chared.c:108: error: dereferencing pointer to incomplete type
    chared.c:109: error: dereferencing pointer to incomplete type
    chared.c:111: error: dereferencing pointer to incomplete type
    chared.c:111: error: dereferencing pointer to incomplete type
    chared.c:114: error: dereferencing pointer to incomplete type
    chared.c: In Funktion »c_delbefore«:
    chared.c:126: error: dereferencing pointer to incomplete type
    chared.c:126: error: dereferencing pointer to incomplete type
    chared.c:127: error: dereferencing pointer to incomplete type
    chared.c:127: error: dereferencing pointer to incomplete type
    chared.c:132: error: dereferencing pointer to incomplete type
    chared.c:132: error: dereferencing pointer to incomplete type
    chared.c:134: error: dereferencing pointer to incomplete type
    chared.c:136: error: dereferencing pointer to incomplete type
    chared.c:137: error: dereferencing pointer to incomplete type
    chared.c:141: error: dereferencing pointer to incomplete type
    chared.c: In Funktion »cv_next_word«:
    chared.c:224: error: dereferencing pointer to incomplete type
    chared.c: In Funktion »cv_prev_word«:
    chared.c:251: error: dereferencing pointer to incomplete type
    chared.c: In Funktion »cv_delfini«:
    chared.c:313: error: dereferencing pointer to incomplete type
    chared.c:314: error: dereferencing pointer to incomplete type
    chared.c:314: error: dereferencing pointer to incomplete type
    chared.c:316: error: dereferencing pointer to incomplete type
    chared.c:317: error: dereferencing pointer to incomplete type
    chared.c:319: error: dereferencing pointer to incomplete type
    chared.c:323: error: dereferencing pointer to incomplete type
    chared.c:323: error: dereferencing pointer to incomplete type
    chared.c:324: error: dereferencing pointer to incomplete type
    chared.c:324: error: dereferencing pointer to incomplete type
    chared.c:326: error: dereferencing pointer to incomplete type
    chared.c:326: error: dereferencing pointer to incomplete type
    chared.c:328: error: dereferencing pointer to incomplete type
    chared.c:328: error: dereferencing pointer to incomplete type
    chared.c:329: error: dereferencing pointer to incomplete type
    chared.c:329: error: dereferencing pointer to incomplete type
    chared.c:337: error: dereferencing pointer to incomplete type
    chared.c:340: error: dereferencing pointer to incomplete type
    chared.c:350: error: dereferencing pointer to incomplete type
    chared.c:350: error: dereferencing pointer to incomplete type
    chared.c:351: error: dereferencing pointer to incomplete type
    chared.c: In Funktion »ch_init«:
    chared.c:407: error: dereferencing pointer to incomplete type
    chared.c:408: error: dereferencing pointer to incomplete type
    chared.c:411: error: dereferencing pointer to incomplete type
    chared.c:411: error: dereferencing pointer to incomplete type
    chared.c:411: error: dereferencing pointer to incomplete type
    chared.c:411: error: dereferencing pointer to incomplete type
    chared.c:412: error: dereferencing pointer to incomplete type
    chared.c:412: error: dereferencing pointer to incomplete type
    chared.c:413: error: dereferencing pointer to incomplete type
    chared.c:413: error: dereferencing pointer to incomplete type
    chared.c:414: error: dereferencing pointer to incomplete type
    chared.c:414: error: dereferencing pointer to incomplete type
    chared.c:416: error: dereferencing pointer to incomplete type
    chared.c:417: error: dereferencing pointer to incomplete type
    chared.c:419: error: dereferencing pointer to incomplete type
    chared.c:419: error: dereferencing pointer to incomplete type
    chared.c:419: error: dereferencing pointer to incomplete type
    chared.c:419: error: dereferencing pointer to incomplete type
    chared.c:420: error: dereferencing pointer to incomplete type
    chared.c:421: error: dereferencing pointer to incomplete type
    chared.c:422: error: dereferencing pointer to incomplete type
    chared.c:423: error: dereferencing pointer to incomplete type
    chared.c:423: error: dereferencing pointer to incomplete type
    chared.c:425: error: dereferencing pointer to incomplete type
    chared.c:426: error: dereferencing pointer to incomplete type
    chared.c:426: error: dereferencing pointer to incomplete type
    chared.c:427: error: dereferencing pointer to incomplete type
    chared.c:427: error: dereferencing pointer to incomplete type
    chared.c:429: error: dereferencing pointer to incomplete type
    chared.c:430: error: dereferencing pointer to incomplete type
    chared.c:432: error: dereferencing pointer to incomplete type
    chared.c:432: error: dereferencing pointer to incomplete type
    chared.c:432: error: dereferencing pointer to incomplete type
    chared.c:432: error: dereferencing pointer to incomplete type
    chared.c:433: error: dereferencing pointer to incomplete type
    chared.c:433: error: dereferencing pointer to incomplete type
    chared.c:434: error: dereferencing pointer to incomplete type
    chared.c:434: error: dereferencing pointer to incomplete type
    chared.c:436: error: dereferencing pointer to incomplete type
    chared.c:436: error: dereferencing pointer to incomplete type
    chared.c:438: error: dereferencing pointer to incomplete type
    chared.c:439: error: dereferencing pointer to incomplete type
    chared.c:440: error: dereferencing pointer to incomplete type
    chared.c:441: error: dereferencing pointer to incomplete type
    chared.c:442: error: dereferencing pointer to incomplete type
    chared.c:444: error: dereferencing pointer to incomplete type
    chared.c:445: error: dereferencing pointer to incomplete type
    chared.c:446: error: dereferencing pointer to incomplete type
    chared.c:448: error: dereferencing pointer to incomplete type
    chared.c: In Funktion »ch_reset«:
    chared.c:459: error: dereferencing pointer to incomplete type
    chared.c:459: error: dereferencing pointer to incomplete type
    chared.c:460: error: dereferencing pointer to incomplete type
    chared.c:460: error: dereferencing pointer to incomplete type
    chared.c:462: error: dereferencing pointer to incomplete type
    chared.c:463: error: dereferencing pointer to incomplete type
    chared.c:464: error: dereferencing pointer to incomplete type
    chared.c:465: error: dereferencing pointer to incomplete type
    chared.c:465: error: dereferencing pointer to incomplete type
    chared.c:467: error: dereferencing pointer to incomplete type
    chared.c:468: error: dereferencing pointer to incomplete type
    chared.c:468: error: dereferencing pointer to incomplete type
    chared.c:469: error: dereferencing pointer to incomplete type
    chared.c:469: error: dereferencing pointer to incomplete type
    chared.c:471: error: dereferencing pointer to incomplete type
    chared.c:471: error: dereferencing pointer to incomplete type
    chared.c:473: error: dereferencing pointer to incomplete type
    chared.c:473: error: dereferencing pointer to incomplete type
    chared.c:475: error: dereferencing pointer to incomplete type
    chared.c:476: error: dereferencing pointer to incomplete type
    chared.c:477: error: dereferencing pointer to incomplete type
    chared.c:478: error: dereferencing pointer to incomplete type
    chared.c:479: error: dereferencing pointer to incomplete type
    chared.c:481: error: dereferencing pointer to incomplete type
    chared.c:483: error: dereferencing pointer to incomplete type
    chared.c: In Funktion »ch_enlargebufs«:
    chared.c:498: error: dereferencing pointer to incomplete type
    chared.c:498: error: dereferencing pointer to incomplete type
    chared.c:512: error: dereferencing pointer to incomplete type
    chared.c:519: error: dereferencing pointer to incomplete type
    chared.c:521: error: dereferencing pointer to incomplete type
    chared.c:522: error: dereferencing pointer to incomplete type
    chared.c:522: error: dereferencing pointer to incomplete type
    chared.c:523: error: dereferencing pointer to incomplete type
    chared.c:523: error: dereferencing pointer to incomplete type
    chared.c:524: error: dereferencing pointer to incomplete type
    chared.c:529: error: dereferencing pointer to incomplete type
    chared.c:536: error: dereferencing pointer to incomplete type
    chared.c:538: error: dereferencing pointer to incomplete type
    chared.c:539: error: dereferencing pointer to incomplete type
    chared.c:540: error: dereferencing pointer to incomplete type
    chared.c:541: error: dereferencing pointer to incomplete type
    chared.c:541: error: dereferencing pointer to incomplete type
    chared.c:542: error: dereferencing pointer to incomplete type
    chared.c:547: error: dereferencing pointer to incomplete type
    chared.c:554: error: dereferencing pointer to incomplete type
    chared.c:554: error: dereferencing pointer to incomplete type
    chared.c:555: error: dereferencing pointer to incomplete type
    chared.c:556: error: dereferencing pointer to incomplete type
    chared.c: In Funktion »ch_end«:
    chared.c:570: error: dereferencing pointer to incomplete type
    chared.c:571: error: dereferencing pointer to incomplete type
    chared.c:572: error: dereferencing pointer to incomplete type
    chared.c:573: error: dereferencing pointer to incomplete type
    chared.c:574: error: dereferencing pointer to incomplete type
    chared.c:575: error: dereferencing pointer to incomplete type
    chared.c:576: error: dereferencing pointer to incomplete type
    chared.c:577: error: dereferencing pointer to incomplete type
    chared.c:578: error: dereferencing pointer to incomplete type
    chared.c: In Funktion »el_insertstr«:
    chared.c:593: error: dereferencing pointer to incomplete type
    chared.c:593: error: dereferencing pointer to incomplete type
    chared.c:600: error: dereferencing pointer to incomplete type
    chared.c: In Funktion »el_deletestr«:
    chared.c:614: error: dereferencing pointer to incomplete type
    chared.c:614: error: dereferencing pointer to incomplete type
    chared.c:618: error: dereferencing pointer to incomplete type
    chared.c:619: error: dereferencing pointer to incomplete type
    chared.c:619: error: dereferencing pointer to incomplete type
    chared.c:620: error: dereferencing pointer to incomplete type
    chared.c:620: error: dereferencing pointer to incomplete type
    chared.c: In Funktion »c_gets«:
    chared.c:639: error: dereferencing pointer to incomplete type
    chared.c:640: error: dereferencing pointer to incomplete type
    chared.c:640: error: dereferencing pointer to incomplete type
    chared.c:643: error: dereferencing pointer to incomplete type
    chared.c:644: error: dereferencing pointer to incomplete type
    chared.c:644: error: dereferencing pointer to incomplete type
    chared.c:645: error: dereferencing pointer to incomplete type
    chared.c:645: error: dereferencing pointer to incomplete type
    chared.c:662: error: dereferencing pointer to incomplete type
    chared.c:663: error: dereferencing pointer to incomplete type
    chared.c:663: error: dereferencing pointer to incomplete type
    chared.c: In Funktion »c_hpos«:
    chared.c:686: error: dereferencing pointer to incomplete type
    chared.c:686: error: dereferencing pointer to incomplete type
    chared.c:689: error: dereferencing pointer to incomplete type
    chared.c:690: error: dereferencing pointer to incomplete type
    chared.c:693: error: dereferencing pointer to incomplete type
    In file included from editline.c:8:
    el.c: In Funktion »el_init«:
    el.c:65: error: invalid application of `sizeof' to an incomplete type
    el.c:70: error: invalid application of `sizeof' to an incomplete type
    el.c:70: error: invalid application of `sizeof' to an incomplete type
    el.c:70: error: invalid application of `sizeof' to an incomplete type
    el.c:70: error: invalid application of `sizeof' to an incomplete type
    el.c:70: error: invalid application of `sizeof' to an incomplete type
    el.c:70: error: invalid application of `sizeof' to an incomplete type
    el.c:72: error: dereferencing pointer to incomplete type
    el.c:73: error: dereferencing pointer to incomplete type
    el.c:74: error: dereferencing pointer to incomplete type
    el.c:75: error: dereferencing pointer to incomplete type
    el.c:80: error: dereferencing pointer to incomplete type
    el.c:83: error: dereferencing pointer to incomplete type
    el.c:90: error: dereferencing pointer to incomplete type
    el.c: In Funktion »el_end«:
    el.c:124: error: dereferencing pointer to incomplete type
    el.c:125: error: dereferencing pointer to incomplete type
    el.c: In Funktion »el_set«:
    el.c:171: error: dereferencing pointer to incomplete type
    el.c:173: error: dereferencing pointer to incomplete type
    el.c:244: error: dereferencing pointer to incomplete type
    el.c:246: error: dereferencing pointer to incomplete type
    el.c:258: error: dereferencing pointer to incomplete type
    el.c: In Funktion »el_get«:
    el.c:292: error: dereferencing pointer to incomplete type
    el.c:297: error: dereferencing pointer to incomplete type
    el.c:378: error: dereferencing pointer to incomplete type
    el.c: In Funktion »el_line«:
    el.c:397: error: dereferencing pointer to incomplete type
    el.c: In Funktion »el_resize«:
    el.c:466: error: `SIG_BLOCK' undeclared (first use in this function)
    el.c:466: error: (Each undeclared identifier is reported only once
    el.c:466: error: for each function it appears in.)
    el.c:472: error: `SIG_SETMASK' undeclared (first use in this function)
    el.c: In Funktion »el_editmode«:
    el.c:501: error: dereferencing pointer to incomplete type
    el.c:503: error: dereferencing pointer to incomplete type
    el.c:505: error: dereferencing pointer to incomplete type
    In file included from editline.c:9:
    hist.c: In Funktion »hist_init«:
    hist.c:61: error: dereferencing pointer to incomplete type
    hist.c:62: error: dereferencing pointer to incomplete type
    hist.c:63: error: dereferencing pointer to incomplete type
    hist.c:64: error: dereferencing pointer to incomplete type
    hist.c:65: error: dereferencing pointer to incomplete type
    hist.c:67: error: dereferencing pointer to incomplete type
    hist.c:67: error: dereferencing pointer to incomplete type
    hist.c: In Funktion »hist_end«:
    hist.c:79: error: dereferencing pointer to incomplete type
    hist.c:80: error: dereferencing pointer to incomplete type
    hist.c: In Funktion »hist_set«:
    hist.c:91: error: dereferencing pointer to incomplete type
    hist.c:92: error: dereferencing pointer to incomplete type
    hist.c: In Funktion »hist_get«:
    hist.c:107: error: dereferencing pointer to incomplete type
    hist.c:108: error: dereferencing pointer to incomplete type
    hist.c:108: error: dereferencing pointer to incomplete type
    hist.c:108: error: dereferencing pointer to incomplete type
    hist.c:108: error: dereferencing pointer to incomplete type
    hist.c:108: error: dereferencing pointer to incomplete type
    hist.c:108: error: dereferencing pointer to incomplete type
    hist.c:108: error: dereferencing pointer to incomplete type
    hist.c:108: error: dereferencing pointer to incomplete type
    hist.c:108: error: dereferencing pointer to incomplete type
    hist.c:108: error: dereferencing pointer to incomplete type
    hist.c:108: error: dereferencing pointer to incomplete type
    hist.c:108: error: dereferencing pointer to incomplete type
    hist.c:108: error: dereferencing pointer to incomplete type
    hist.c:110: error: dereferencing pointer to incomplete type
    hist.c:110: error: dereferencing pointer to incomplete type
    hist.c:111: error: dereferencing pointer to incomplete type
    hist.c:111: error: dereferencing pointer to incomplete type
    hist.c:114: error: dereferencing pointer to incomplete type
    hist.c:115: error: dereferencing pointer to incomplete type
    hist.c:115: error: dereferencing pointer to incomplete type
    hist.c:118: error: dereferencing pointer to incomplete type
    hist.c:118: error: dereferencing pointer to incomplete type
    hist.c:122: error: dereferencing pointer to incomplete type
    hist.c:125: error: dereferencing pointer to incomplete type
    hist.c:125: error: dereferencing pointer to incomplete type
    hist.c:125: error: dereferencing pointer to incomplete type
    hist.c:125: error: dereferencing pointer to incomplete type
    hist.c:130: error: dereferencing pointer to incomplete type
    hist.c:131: error: dereferencing pointer to incomplete type
    hist.c:131: error: dereferencing pointer to incomplete type
    hist.c:131: error: dereferencing pointer to incomplete type
    hist.c:131: error: dereferencing pointer to incomplete type
    hist.c:132: error: dereferencing pointer to incomplete type
    hist.c:135: error: dereferencing pointer to incomplete type
    hist.c:135: error: dereferencing pointer to incomplete type
    hist.c:135: error: dereferencing pointer to incomplete type
    hist.c:135: error: dereferencing pointer to incomplete type
    hist.c:135: error: dereferencing pointer to incomplete type
    hist.c:135: error: dereferencing pointer to incomplete type
    hist.c:135: error: dereferencing pointer to incomplete type
    hist.c:135: error: dereferencing pointer to incomplete type
    hist.c:135: error: dereferencing pointer to incomplete type
    hist.c:135: error: dereferencing pointer to incomplete type
    hist.c:135: error: dereferencing pointer to incomplete type
    hist.c:135: error: dereferencing pointer to incomplete type
    hist.c:135: error: dereferencing pointer to incomplete type
    hist.c:137: error: dereferencing pointer to incomplete type
    hist.c:137: error: dereferencing pointer to incomplete type
    hist.c:137: error: dereferencing pointer to incomplete type
    hist.c:139: error: dereferencing pointer to incomplete type
    hist.c:139: error: dereferencing pointer to incomplete type
    hist.c:140: error: dereferencing pointer to incomplete type
    hist.c:141: error: dereferencing pointer to incomplete type
    hist.c:142: error: dereferencing pointer to incomplete type
    hist.c:142: error: dereferencing pointer to incomplete type
    hist.c:142: error: dereferencing pointer to incomplete type
    hist.c:143: error: dereferencing pointer to incomplete type
    hist.c:144: error: dereferencing pointer to incomplete type
    hist.c:144: error: dereferencing pointer to incomplete type
    hist.c:145: error: dereferencing pointer to incomplete type
    hist.c:145: error: dereferencing pointer to incomplete type
    hist.c:148: error: dereferencing pointer to incomplete type
    hist.c:149: error: dereferencing pointer to incomplete type
    hist.c:149: error: dereferencing pointer to incomplete type
    hist.c:152: error: dereferencing pointer to incomplete type
    hist.c:152: error: dereferencing pointer to incomplete type
    hist.c: In Funktion »hist_list«:
    hist.c:167: error: dereferencing pointer to incomplete type
    hist.c:169: error: dereferencing pointer to incomplete type
    hist.c:169: error: dereferencing pointer to incomplete type
    hist.c:169: error: dereferencing pointer to incomplete type
    hist.c:169: error: dereferencing pointer to incomplete type
    hist.c:169: error: dereferencing pointer to incomplete type
    hist.c:169: error: dereferencing pointer to incomplete type
    hist.c:169: error: dereferencing pointer to incomplete type
    hist.c:169: error: dereferencing pointer to incomplete type
    hist.c:170: error: dereferencing pointer to incomplete type
    hist.c:171: error: dereferencing pointer to incomplete type
    hist.c: In Funktion »hist_enlargebuf«:
    hist.c:185: error: dereferencing pointer to incomplete type
    hist.c:191: error: dereferencing pointer to incomplete type
    hist.c:192: error: dereferencing pointer to incomplete type
    hist.c:192: error: dereferencing pointer to incomplete type
    hist.c:193: error: dereferencing pointer to incomplete type
    hist.c:194: error: dereferencing pointer to incomplete type
    In file included from editline.c:10:
    key.c: In Funktion »key_init«:
    key.c:109: error: dereferencing pointer to incomplete type
    key.c:110: error: dereferencing pointer to incomplete type
    key.c:112: error: dereferencing pointer to incomplete type
    key.c: In Funktion »key_end«:
    key.c:125: error: dereferencing pointer to incomplete type
    key.c:126: error: dereferencing pointer to incomplete type
    key.c:127: error: dereferencing pointer to incomplete type
    key.c:128: error: dereferencing pointer to incomplete type
    key.c: In Funktion »key_map_cmd«:
    key.c:139: error: dereferencing pointer to incomplete type
    key.c:140: error: dereferencing pointer to incomplete type
    key.c: In Funktion »key_map_str«:
    key.c:151: error: dereferencing pointer to incomplete type
    key.c:152: error: dereferencing pointer to incomplete type
    key.c: In Funktion »key_reset«:
    key.c:165: error: dereferencing pointer to incomplete type
    key.c:166: error: dereferencing pointer to incomplete type
    key.c: In Funktion »key_get«:
    key.c:183: error: dereferencing pointer to incomplete type
    key.c: In Funktion »key_add«:
    key.c:198: error: dereferencing pointer to incomplete type
    key.c:203: error: dereferencing pointer to incomplete type
    key.c:207: error: dereferencing pointer to incomplete type
    key.c:209: error: dereferencing pointer to incomplete type
    key.c:213: error: dereferencing pointer to incomplete type
    key.c: In Funktion »key_clear«:
    key.c:226: error: dereferencing pointer to incomplete type
    key.c:227: error: dereferencing pointer to incomplete type
    key.c:228: error: dereferencing pointer to incomplete type
    key.c:229: error: dereferencing pointer to incomplete type
    key.c: In Funktion »key_delete«:
    key.c:243: error: dereferencing pointer to incomplete type
    key.c:247: error: dereferencing pointer to incomplete type
    key.c:250: error: dereferencing pointer to incomplete type
    key.c: In Funktion »key_print«:
    key.c:264: error: dereferencing pointer to incomplete type
    key.c:267: error: dereferencing pointer to incomplete type
    key.c:268: error: dereferencing pointer to incomplete type
    key.c:270: error: dereferencing pointer to incomplete type
    key.c: In Funktion »node__try«:
    key.c:359: Warnung: Zuweisung erzeugt Zeiger von Ganzzahl ohne Typkonvertierung
    key.c: In Funktion »node_lookup«:
    key.c:496: error: dereferencing pointer to incomplete type
    key.c:505: error: dereferencing pointer to incomplete type
    key.c:506: error: dereferencing pointer to incomplete type
    key.c:507: error: dereferencing pointer to incomplete type
    key.c: In Funktion »node_enum«:
    key.c:535: error: dereferencing pointer to incomplete type
    key.c:536: error: dereferencing pointer to incomplete type
    key.c:537: error: dereferencing pointer to incomplete type
    key.c:539: error: dereferencing pointer to incomplete type
    key.c:539: error: dereferencing pointer to incomplete type
    key.c:550: error: dereferencing pointer to incomplete type
    key.c:553: error: dereferencing pointer to incomplete type
    key.c:554: error: dereferencing pointer to incomplete type
    key.c:555: error: dereferencing pointer to incomplete type
    key.c: In Funktion »key_kprint«:
    key.c:581: error: dereferencing pointer to incomplete type
    key.c:586: error: dereferencing pointer to incomplete type
    key.c:588: error: dereferencing pointer to incomplete type
    key.c:604: error: dereferencing pointer to incomplete type
    In file included from editline.c:11:
    map.c: In Funktion »map_init«:
    map.c:912: error: dereferencing pointer to incomplete type
    map.c:913: error: dereferencing pointer to incomplete type
    map.c:915: error: dereferencing pointer to incomplete type
    map.c:916: error: dereferencing pointer to incomplete type
    map.c:918: error: dereferencing pointer to incomplete type
    map.c:919: error: dereferencing pointer to incomplete type
    map.c:920: error: dereferencing pointer to incomplete type
    map.c:921: error: dereferencing pointer to incomplete type
    map.c:923: error: dereferencing pointer to incomplete type
    map.c:925: error: dereferencing pointer to incomplete type
    map.c:927: error: dereferencing pointer to incomplete type
    map.c:929: error: dereferencing pointer to incomplete type
    map.c:931: error: dereferencing pointer to incomplete type
    map.c:932: error: dereferencing pointer to incomplete type
    map.c: In Funktion »map_end«:
    map.c:950: error: dereferencing pointer to incomplete type
    map.c:951: error: dereferencing pointer to incomplete type
    map.c:952: error: dereferencing pointer to incomplete type
    map.c:953: error: dereferencing pointer to incomplete type
    map.c:954: error: dereferencing pointer to incomplete type
    map.c:955: error: dereferencing pointer to incomplete type
    map.c:956: error: dereferencing pointer to incomplete type
    map.c:957: error: dereferencing pointer to incomplete type
    map.c:958: error: dereferencing pointer to incomplete type
    map.c:959: error: dereferencing pointer to incomplete type
    map.c:960: error: dereferencing pointer to incomplete type
    map.c: In Funktion »map_init_nls«:
    map.c:972: error: dereferencing pointer to incomplete type
    map.c: In Funktion »map_init_meta«:
    map.c:988: error: dereferencing pointer to incomplete type
    map.c:989: error: dereferencing pointer to incomplete type
    map.c:999: error: dereferencing pointer to incomplete type
    map.c: In Funktion »map_init_vi«:
    map.c:1028: error: dereferencing pointer to incomplete type
    map.c:1029: error: dereferencing pointer to incomplete type
    map.c:1030: error: dereferencing pointer to incomplete type
    map.c:1031: error: dereferencing pointer to incomplete type
    map.c:1033: error: dereferencing pointer to incomplete type
    map.c:1034: error: dereferencing pointer to incomplete type
    map.c:1034: error: dereferencing pointer to incomplete type
    map.c: In Funktion »map_init_emacs«:
    map.c:1059: error: dereferencing pointer to incomplete type
    map.c:1060: error: dereferencing pointer to incomplete type
    map.c:1061: error: dereferencing pointer to incomplete type
    map.c:1063: error: dereferencing pointer to incomplete type
    map.c:1064: error: dereferencing pointer to incomplete type
    map.c:1064: error: dereferencing pointer to incomplete type
    map.c: In Funktion »map_get_editor«:
    map.c:1113: error: dereferencing pointer to incomplete type
    map.c: In Funktion »map_print_key«:
    map.c:1136: error: dereferencing pointer to incomplete type
    map.c:1138: error: dereferencing pointer to incomplete type
    map.c: In Funktion »map_print_some_keys«:
    map.c:1163: error: dereferencing pointer to incomplete type
    map.c:1168: error: dereferencing pointer to incomplete type
    map.c:1171: error: dereferencing pointer to incomplete type
    map.c:1175: error: dereferencing pointer to incomplete type
    map.c: In Funktion »map_print_all_keys«:
    map.c:1211: error: dereferencing pointer to incomplete type
    map.c:1214: error: dereferencing pointer to incomplete type
    map.c:1214: error: dereferencing pointer to incomplete type
    map.c:1216: error: dereferencing pointer to incomplete type
    map.c:1219: error: dereferencing pointer to incomplete type
    map.c:1221: error: dereferencing pointer to incomplete type
    map.c:1224: error: dereferencing pointer to incomplete type
    map.c:1224: error: dereferencing pointer to incomplete type
    map.c:1226: error: dereferencing pointer to incomplete type
    map.c:1229: error: dereferencing pointer to incomplete type
    map.c:1231: error: dereferencing pointer to incomplete type
    map.c:1233: error: dereferencing pointer to incomplete type
    map.c: In Funktion »map_bind«:
    map.c:1258: error: dereferencing pointer to incomplete type
    map.c:1265: error: dereferencing pointer to incomplete type
    map.c:1293: error: dereferencing pointer to incomplete type
    map.c:1295: error: dereferencing pointer to incomplete type
    map.c:1300: error: dereferencing pointer to incomplete type
    map.c:1314: error: dereferencing pointer to incomplete type
    map.c:1350: error: dereferencing pointer to incomplete type
    map.c:1363: error: dereferencing pointer to incomplete type
    map.c: In Funktion »map_addfunc«:
    map.c:1395: error: dereferencing pointer to incomplete type
    map.c:1400: error: dereferencing pointer to incomplete type
    map.c:1402: error: dereferencing pointer to incomplete type
    map.c:1403: error: dereferencing pointer to incomplete type
    map.c:1406: error: dereferencing pointer to incomplete type
    map.c:1408: error: dereferencing pointer to incomplete type
    map.c:1409: error: dereferencing pointer to incomplete type
    map.c:1411: error: dereferencing pointer to incomplete type
    map.c:1412: error: dereferencing pointer to incomplete type
    map.c:1413: error: dereferencing pointer to incomplete type
    map.c:1414: error: dereferencing pointer to incomplete type
    map.c:1415: error: dereferencing pointer to incomplete type
    In file included from editline.c:12:
    parse.c: In Funktion »el_parse«:
    parse.c:123: error: dereferencing pointer to incomplete type
    parse.c: In Funktion »parse_cmd«:
    parse.c:255: error: dereferencing pointer to incomplete type
    In file included from editline.c:13:
    prompt.c: In Funktion »prompt_print«:
    prompt.c:96: error: dereferencing pointer to incomplete type
    prompt.c:98: error: dereferencing pointer to incomplete type
    prompt.c:103: error: dereferencing pointer to incomplete type
    prompt.c:104: error: dereferencing pointer to incomplete type
    prompt.c: In Funktion »prompt_init«:
    prompt.c:115: error: dereferencing pointer to incomplete type
    prompt.c:116: error: dereferencing pointer to incomplete type
    prompt.c:117: error: dereferencing pointer to incomplete type
    prompt.c:118: error: dereferencing pointer to incomplete type
    prompt.c:119: error: dereferencing pointer to incomplete type
    prompt.c:120: error: dereferencing pointer to incomplete type
    prompt.c: In Funktion »prompt_set«:
    prompt.c:144: error: dereferencing pointer to incomplete type
    prompt.c:146: error: dereferencing pointer to incomplete type
    prompt.c: In Funktion »prompt_get«:
    prompt.c:170: error: dereferencing pointer to incomplete type
    prompt.c:172: error: dereferencing pointer to incomplete type
    In file included from editline.c:14:
    read.c: In Funktion »read_init«:
    read.c:71: error: dereferencing pointer to incomplete type
    read.c: In Funktion »el_read_setfn«:
    read.c:83: error: dereferencing pointer to incomplete type
    read.c: In Funktion »el_read_getfn«:
    read.c:95: error: dereferencing pointer to incomplete type
    read.c:96: error: dereferencing pointer to incomplete type
    read.c: In Funktion »read_preread«:
    read.c:189: error: dereferencing pointer to incomplete type
    read.c:190: error: dereferencing pointer to incomplete type
    read.c:191: error: dereferencing pointer to incomplete type
    read.c:193: error: dereferencing pointer to incomplete type
    read.c: In Funktion »el_push«:
    read.c:221: error: dereferencing pointer to incomplete type
    read.c: In Funktion »read_getcmd«:
    read.c:254: error: dereferencing pointer to incomplete type
    read.c:255: error: dereferencing pointer to incomplete type
    read.c:258: error: dereferencing pointer to incomplete type
    read.c:279: error: dereferencing pointer to incomplete type
    read.c:280: error: dereferencing pointer to incomplete type
    read.c:280: error: dereferencing pointer to incomplete type
    read.c: In Funktion »read_char«:
    read.c:296: error: dereferencing pointer to incomplete type
    read.c:297: error: dereferencing pointer to incomplete type
    read.c: In Funktion »el_getc«:
    read.c:315: error: dereferencing pointer to incomplete type
    read.c:347: error: dereferencing pointer to incomplete type
    read.c: In Funktion »el_gets«:
    read.c:366: error: dereferencing pointer to incomplete type
    read.c:369: error: dereferencing pointer to incomplete type
    read.c:370: error: dereferencing pointer to incomplete type
    read.c:373: error: dereferencing pointer to incomplete type
    read.c:375: error: dereferencing pointer to incomplete type
    read.c:376: error: dereferencing pointer to incomplete type
    read.c:379: error: dereferencing pointer to incomplete type
    read.c:386: error: dereferencing pointer to incomplete type
    read.c:386: error: dereferencing pointer to incomplete type
    read.c:389: error: dereferencing pointer to incomplete type
    read.c:389: error: dereferencing pointer to incomplete type
    read.c:390: error: dereferencing pointer to incomplete type
    read.c:412: error: dereferencing pointer to incomplete type
    read.c:413: error: dereferencing pointer to incomplete type
    read.c:418: error: dereferencing pointer to incomplete type
    read.c:420: error: dereferencing pointer to incomplete type
    read.c:421: error: dereferencing pointer to incomplete type
    read.c:424: error: dereferencing pointer to incomplete type
    read.c:431: error: dereferencing pointer to incomplete type
    read.c:431: error: dereferencing pointer to incomplete type
    read.c:434: error: dereferencing pointer to incomplete type
    read.c:434: error: dereferencing pointer to incomplete type
    read.c:435: error: dereferencing pointer to incomplete type
    read.c:450: error: dereferencing pointer to incomplete type
    read.c:472: error: dereferencing pointer to incomplete type
    read.c:475: error: dereferencing pointer to incomplete type
    read.c:480: error: dereferencing pointer to incomplete type
    read.c:481: error: dereferencing pointer to incomplete type
    read.c:491: error: dereferencing pointer to incomplete type
    read.c:492: error: dereferencing pointer to incomplete type
    read.c:497: error: dereferencing pointer to incomplete type
    read.c:498: error: dereferencing pointer to incomplete type
    read.c:504: error: dereferencing pointer to incomplete type
    read.c:505: error: dereferencing pointer to incomplete type
    read.c:517: error: dereferencing pointer to incomplete type
    read.c:517: error: dereferencing pointer to incomplete type
    read.c:529: error: dereferencing pointer to incomplete type
    read.c:530: error: dereferencing pointer to incomplete type
    read.c:539: error: dereferencing pointer to incomplete type
    read.c:540: error: dereferencing pointer to incomplete type
    read.c:550: error: dereferencing pointer to incomplete type
    read.c:554: error: dereferencing pointer to incomplete type
    In file included from editline.c:15:
    refresh.c: In Funktion »re_addc«:
    refresh.c:107: error: dereferencing pointer to incomplete type
    refresh.c:109: error: dereferencing pointer to incomplete type
    refresh.c:110: error: dereferencing pointer to incomplete type
    refresh.c:111: error: dereferencing pointer to incomplete type
    refresh.c:118: error: dereferencing pointer to incomplete type
    refresh.c: In Funktion »re_putc«:
    refresh.c:146: error: dereferencing pointer to incomplete type
    refresh.c:146: error: dereferencing pointer to incomplete type
    refresh.c:146: error: dereferencing pointer to incomplete type
    refresh.c:150: error: dereferencing pointer to incomplete type
    refresh.c:151: error: dereferencing pointer to incomplete type
    refresh.c:151: error: dereferencing pointer to incomplete type
    refresh.c:152: error: dereferencing pointer to incomplete type
    refresh.c:152: error: dereferencing pointer to incomplete type
    refresh.c:152: error: dereferencing pointer to incomplete type
    refresh.c:154: error: dereferencing pointer to incomplete type
    refresh.c:162: error: dereferencing pointer to incomplete type
    refresh.c:162: error: dereferencing pointer to incomplete type
    refresh.c:163: error: dereferencing pointer to incomplete type
    refresh.c:164: error: dereferencing pointer to incomplete type
    refresh.c:167: error: dereferencing pointer to incomplete type
    refresh.c:167: error: dereferencing pointer to incomplete type
    refresh.c:170: error: dereferencing pointer to incomplete type
    refresh.c:172: error: dereferencing pointer to incomplete type
    refresh.c: In Funktion »re_refresh«:
    refresh.c:202: error: dereferencing pointer to incomplete type
    refresh.c:203: error: dereferencing pointer to incomplete type
    refresh.c:209: error: dereferencing pointer to incomplete type
    refresh.c:210: error: dereferencing pointer to incomplete type
    refresh.c:232: error: dereferencing pointer to incomplete type
    refresh.c:234: error: dereferencing pointer to incomplete type
    refresh.c:235: error: dereferencing pointer to incomplete type
    refresh.c:237: error: dereferencing pointer to incomplete type
    refresh.c:238: error: dereferencing pointer to incomplete type
    refresh.c:244: error: dereferencing pointer to incomplete type
    refresh.c:245: error: dereferencing pointer to incomplete type
    refresh.c:247: error: dereferencing pointer to incomplete type
    refresh.c:247: error: dereferencing pointer to incomplete type
    refresh.c:248: error: dereferencing pointer to incomplete type
    refresh.c:249: error: dereferencing pointer to incomplete type
    refresh.c:249: error: dereferencing pointer to incomplete type
    refresh.c:250: error: dereferencing pointer to incomplete type
    refresh.c:260: error: dereferencing pointer to incomplete type
    refresh.c:261: error: dereferencing pointer to incomplete type
    refresh.c:266: error: dereferencing pointer to incomplete type
    refresh.c:266: error: dereferencing pointer to incomplete type
    refresh.c:274: error: dereferencing pointer to incomplete type
    refresh.c:276: error: dereferencing pointer to incomplete type
    refresh.c:276: error: dereferencing pointer to incomplete type
    refresh.c:285: error: dereferencing pointer to incomplete type
    refresh.c:285: error: dereferencing pointer to incomplete type
    refresh.c:286: error: dereferencing pointer to incomplete type
    refresh.c:292: error: dereferencing pointer to incomplete type
    refresh.c:292: error: dereferencing pointer to incomplete type
    refresh.c:293: error: dereferencing pointer to incomplete type
    refresh.c:296: error: dereferencing pointer to incomplete type
    refresh.c:300: error: dereferencing pointer to incomplete type
    refresh.c:303: error: dereferencing pointer to incomplete type
    refresh.c:303: error: dereferencing pointer to incomplete type
    refresh.c: In Funktion »re_goto_bottom«:
    refresh.c:320: error: dereferencing pointer to incomplete type
    refresh.c: In Funktion »re_update_line«:
    refresh.c:581: error: dereferencing pointer to incomplete type
    refresh.c:597: error: dereferencing pointer to incomplete type
    refresh.c:706: error: dereferencing pointer to incomplete type
    refresh.c:726: error: dereferencing pointer to incomplete type
    refresh.c:765: error: dereferencing pointer to incomplete type
    refresh.c:791: error: dereferencing pointer to incomplete type
    refresh.c:856: error: dereferencing pointer to incomplete type
    refresh.c: In Funktion »re_refresh_cursor«:
    refresh.c:937: error: dereferencing pointer to incomplete type
    refresh.c:938: error: dereferencing pointer to incomplete type
    refresh.c:939: error: dereferencing pointer to incomplete type
    refresh.c:942: error: dereferencing pointer to incomplete type
    refresh.c:942: error: dereferencing pointer to incomplete type
    refresh.c: In Funktion »re_fastputc«:
    refresh.c:991: error: dereferencing pointer to incomplete type
    refresh.c:991: error: dereferencing pointer to incomplete type
    refresh.c:991: error: dereferencing pointer to incomplete type
    refresh.c:992: error: dereferencing pointer to incomplete type
    refresh.c:992: error: dereferencing pointer to incomplete type
    refresh.c:994: error: dereferencing pointer to incomplete type
    refresh.c:1002: error: dereferencing pointer to incomplete type
    refresh.c:1002: error: dereferencing pointer to incomplete type
    refresh.c:1003: error: dereferencing pointer to incomplete type
    refresh.c:1004: error: dereferencing pointer to incomplete type
    refresh.c:1007: error: dereferencing pointer to incomplete type
    refresh.c:1007: error: dereferencing pointer to incomplete type
    refresh.c:1010: error: dereferencing pointer to incomplete type
    refresh.c:1012: error: dereferencing pointer to incomplete type
    refresh.c:1013: error: dereferencing pointer to incomplete type
    refresh.c:1015: error: dereferencing pointer to incomplete type
    refresh.c:1016: error: dereferencing pointer to incomplete type
    refresh.c: In Funktion »re_fastaddc«:
    refresh.c:1038: error: dereferencing pointer to incomplete type
    refresh.c:1040: error: dereferencing pointer to incomplete type
    refresh.c:1040: error: dereferencing pointer to incomplete type
    refresh.c:1044: error: dereferencing pointer to incomplete type
    refresh.c:1044: error: dereferencing pointer to incomplete type
    refresh.c:1045: error: dereferencing pointer to incomplete type
    refresh.c:1046: error: dereferencing pointer to incomplete type
    refresh.c: In Funktion »re_clear_display«:
    refresh.c:1074: error: dereferencing pointer to incomplete type
    refresh.c:1075: error: dereferencing pointer to incomplete type
    refresh.c:1076: error: dereferencing pointer to incomplete type
    refresh.c:1077: error: dereferencing pointer to incomplete type
    refresh.c:1078: error: dereferencing pointer to incomplete type
    refresh.c: In Funktion »re_clear_lines«:
    refresh.c:1089: error: dereferencing pointer to incomplete type
    refresh.c:1092: error: dereferencing pointer to incomplete type
    refresh.c:1095: error: dereferencing pointer to incomplete type
    refresh.c:1099: error: dereferencing pointer to incomplete type
    In file included from editline.c:16:
    search.c: In Funktion »search_init«:
    search.c:73: error: dereferencing pointer to incomplete type
    search.c:74: error: dereferencing pointer to incomplete type
    search.c:76: error: dereferencing pointer to incomplete type
    search.c:77: error: dereferencing pointer to incomplete type
    search.c:78: error: dereferencing pointer to incomplete type
    search.c:79: error: dereferencing pointer to incomplete type
    search.c: In Funktion »search_end«:
    search.c:91: error: dereferencing pointer to incomplete type
    search.c:92: error: dereferencing pointer to incomplete type
    search.c: In Funktion »c_hmatch«:
    search.c:164: error: dereferencing pointer to incomplete type
    search.c: In Funktion »c_setpat«:
    search.c:174: error: dereferencing pointer to incomplete type
    search.c:175: error: dereferencing pointer to incomplete type
    search.c:176: error: dereferencing pointer to incomplete type
    search.c:176: error: dereferencing pointer to incomplete type
    search.c:176: error: dereferencing pointer to incomplete type
    search.c:176: error: dereferencing pointer to incomplete type
    search.c:176: error: dereferencing pointer to incomplete type
    search.c:176: error: dereferencing pointer to incomplete type
    search.c:177: error: dereferencing pointer to incomplete type
    search.c:178: error: dereferencing pointer to incomplete type
    search.c:179: error: dereferencing pointer to incomplete type
    search.c:180: error: dereferencing pointer to incomplete type
    search.c:180: error: dereferencing pointer to incomplete type
    search.c:180: error: dereferencing pointer to incomplete type
    search.c:180: error: dereferencing pointer to incomplete type
    search.c:180: error: dereferencing pointer to incomplete type
    search.c:180: error: dereferencing pointer to incomplete type
    search.c:180: error: dereferencing pointer to incomplete type
    search.c:180: error: dereferencing pointer to incomplete type
    search.c:180: error: dereferencing pointer to incomplete type
    search.c:180: error: dereferencing pointer to incomplete type
    search.c:180: error: dereferencing pointer to incomplete type
    search.c:180: error: dereferencing pointer to incomplete type
    search.c:180: error: dereferencing pointer to incomplete type
    search.c:182: error: dereferencing pointer to incomplete type
    search.c:182: error: dereferencing pointer to incomplete type
    search.c:184: error: dereferencing pointer to incomplete type
    search.c:184: error: dereferencing pointer to incomplete type
    search.c: In Funktion »ce_inc_search«:
    search.c:209: error: dereferencing pointer to incomplete type
    search.c:214: error: dereferencing pointer to incomplete type
    search.c:215: error: dereferencing pointer to incomplete type
    search.c:219: error: dereferencing pointer to incomplete type
    search.c:220: error: dereferencing pointer to incomplete type
    search.c:220: error: dereferencing pointer to incomplete type
    search.c:225: error: dereferencing pointer to incomplete type
    search.c:228: error: dereferencing pointer to incomplete type
    search.c:228: error: dereferencing pointer to incomplete type
    search.c:229: error: dereferencing pointer to incomplete type
    search.c:229: error: dereferencing pointer to incomplete type
    search.c:233: error: dereferencing pointer to incomplete type
    search.c:235: error: dereferencing pointer to incomplete type
    search.c:237: error: dereferencing pointer to incomplete type
    search.c:238: error: dereferencing pointer to incomplete type
    search.c:239: error: dereferencing pointer to incomplete type
    search.c:239: error: dereferencing pointer to incomplete type
    search.c:240: error: dereferencing pointer to incomplete type
    search.c:242: error: dereferencing pointer to incomplete type
    search.c:248: error: dereferencing pointer to incomplete type
    search.c:251: error: dereferencing pointer to incomplete type
    search.c:254: error: dereferencing pointer to incomplete type
    search.c:254: error: dereferencing pointer to incomplete type
    search.c:256: error: dereferencing pointer to incomplete type
    search.c:257: error: dereferencing pointer to incomplete type
    search.c:273: error: dereferencing pointer to incomplete type
    search.c:288: error: dereferencing pointer to incomplete type
    search.c:289: error: dereferencing pointer to incomplete type
    search.c:289: error: dereferencing pointer to incomplete type
    search.c:290: error: dereferencing pointer to incomplete type
    search.c:291: error: dereferencing pointer to incomplete type
    search.c:292: error: dereferencing pointer to incomplete type
    search.c:293: error: dereferencing pointer to incomplete type
    search.c:295: error: dereferencing pointer to incomplete type
    search.c:296: error: dereferencing pointer to incomplete type
    search.c:297: error: dereferencing pointer to incomplete type
    search.c:302: error: dereferencing pointer to incomplete type
    search.c:302: error: dereferencing pointer to incomplete type
    search.c:303: error: dereferencing pointer to incomplete type
    search.c:304: error: dereferencing pointer to incomplete type
    search.c:305: error: dereferencing pointer to incomplete type
    search.c:307: error: dereferencing pointer to incomplete type
    search.c:308: error: dereferencing pointer to incomplete type
    search.c:330: error: dereferencing pointer to incomplete type
    search.c:330: error: dereferencing pointer to incomplete type
    search.c:331: error: dereferencing pointer to incomplete type
    search.c:332: error: dereferencing pointer to incomplete type
    search.c:333: error: dereferencing pointer to incomplete type
    search.c:338: error: dereferencing pointer to incomplete type
    search.c:338: error: dereferencing pointer to incomplete type
    search.c:340: error: dereferencing pointer to incomplete type
    search.c:346: error: dereferencing pointer to incomplete type
    search.c:349: error: dereferencing pointer to incomplete type
    search.c:356: error: dereferencing pointer to incomplete type
    search.c:358: error: dereferencing pointer to incomplete type
    search.c:359: error: dereferencing pointer to incomplete type
    search.c:361: error: dereferencing pointer to incomplete type
    search.c:367: error: dereferencing pointer to incomplete type
    search.c:367: error: dereferencing pointer to incomplete type
    search.c:369: error: dereferencing pointer to incomplete type
    search.c:369: error: dereferencing pointer to incomplete type
    search.c:372: error: dereferencing pointer to incomplete type
    search.c:372: error: dereferencing pointer to incomplete type
    search.c:374: error: dereferencing pointer to incomplete type
    search.c:374: error: dereferencing pointer to incomplete type
    search.c:375: error: dereferencing pointer to incomplete type
    search.c:375: error: dereferencing pointer to incomplete type
    search.c:377: error: dereferencing pointer to incomplete type
    search.c:380: error: dereferencing pointer to incomplete type
    search.c:386: error: dereferencing pointer to incomplete type
    search.c:388: error: dereferencing pointer to incomplete type
    search.c:389: error: dereferencing pointer to incomplete type
    search.c:391: error: dereferencing pointer to incomplete type
    search.c:395: error: dereferencing pointer to incomplete type
    search.c:395: error: dereferencing pointer to incomplete type
    search.c:399: error: dereferencing pointer to incomplete type
    search.c:401: error: dereferencing pointer to incomplete type
    search.c:406: error: dereferencing pointer to incomplete type
    search.c:425: error: dereferencing pointer to incomplete type
    search.c:426: error: dereferencing pointer to incomplete type
    search.c:427: error: dereferencing pointer to incomplete type
    search.c:431: error: dereferencing pointer to incomplete type
    search.c: In Funktion »cv_search«:
    search.c:457: error: dereferencing pointer to incomplete type
    search.c:458: error: dereferencing pointer to incomplete type
    search.c:458: error: dereferencing pointer to incomplete type
    search.c:459: error: dereferencing pointer to incomplete type
    search.c:459: error: dereferencing pointer to incomplete type
    search.c:460: error: dereferencing pointer to incomplete type
    search.c:463: error: dereferencing pointer to incomplete type
    search.c:464: error: dereferencing pointer to incomplete type
    search.c:481: error: dereferencing pointer to incomplete type
    search.c:482: error: dereferencing pointer to incomplete type
    search.c:483: error: dereferencing pointer to incomplete type
    search.c:483: error: dereferencing pointer to incomplete type
    search.c:484: error: dereferencing pointer to incomplete type
    search.c:484: error: dereferencing pointer to incomplete type
    search.c:489: error: dereferencing pointer to incomplete type
    search.c:490: error: dereferencing pointer to incomplete type
    search.c:491: error: dereferencing pointer to incomplete type
    search.c:491: error: dereferencing pointer to incomplete type
    search.c:491: error: dereferencing pointer to incomplete type
    search.c:491: error: dereferencing pointer to incomplete type
    search.c:491: error: dereferencing pointer to incomplete type
    search.c:493: error: dereferencing pointer to incomplete type
    search.c:494: error: dereferencing pointer to incomplete type
    search.c:495: error: dereferencing pointer to incomplete type
    search.c:495: error: dereferencing pointer to incomplete type
    search.c:495: error: dereferencing pointer to incomplete type
    search.c:497: error: dereferencing pointer to incomplete type
    search.c:498: error: dereferencing pointer to incomplete type
    search.c:498: error: dereferencing pointer to incomplete type
    search.c:499: error: dereferencing pointer to incomplete type
    search.c:499: error: dereferencing pointer to incomplete type
    search.c:500: error: dereferencing pointer to incomplete type
    search.c:500: error: dereferencing pointer to incomplete type
    search.c:509: error: dereferencing pointer to incomplete type
    search.c:509: error: dereferencing pointer to incomplete type
    search.c:509: error: dereferencing pointer to incomplete type
    search.c:510: error: dereferencing pointer to incomplete type
    search.c:512: error: dereferencing pointer to incomplete type
    search.c:513: error: dereferencing pointer to incomplete type
    search.c:513: error: dereferencing pointer to incomplete type
    search.c:513: error: dereferencing pointer to incomplete type
    search.c:521: error: dereferencing pointer to incomplete type
    search.c:522: error: dereferencing pointer to incomplete type
    search.c: In Funktion »ce_search_line«:
    search.c:540: error: dereferencing pointer to incomplete type
    search.c:540: error: dereferencing pointer to incomplete type
    search.c:542: error: dereferencing pointer to incomplete type
    search.c:547: error: dereferencing pointer to incomplete type
    search.c:548: error: dereferencing pointer to incomplete type
    search.c:550: error: dereferencing pointer to incomplete type
    search.c: In Funktion »cv_repeat_srch«:
    search.c:570: error: dereferencing pointer to incomplete type
    search.c:571: error: dereferencing pointer to incomplete type
    search.c:571: error: dereferencing pointer to incomplete type
    search.c: In Funktion »cv_csearch_back«:
    search.c:592: error: dereferencing pointer to incomplete type
    search.c:596: error: dereferencing pointer to incomplete type
    search.c:600: error: dereferencing pointer to incomplete type
    search.c:600: error: dereferencing pointer to incomplete type
    search.c:606: error: dereferencing pointer to incomplete type
    search.c:608: error: dereferencing pointer to incomplete type
    search.c:609: error: dereferencing pointer to incomplete type
    search.c: In Funktion »cv_csearch_fwd«:
    search.c:626: error: dereferencing pointer to incomplete type
    search.c:630: error: dereferencing pointer to incomplete type
    search.c:634: error: dereferencing pointer to incomplete type
    search.c:640: error: dereferencing pointer to incomplete type
    search.c:642: error: dereferencing pointer to incomplete type
    search.c:643: error: dereferencing pointer to incomplete type
    In file included from editline.c:17:
    sig.c: In Funktion »sig_handler«:
    sig.c:80: error: `SIG_BLOCK' undeclared (first use in this function)
    sig.c:103: error: dereferencing pointer to incomplete type
    sig.c:104: error: `SIG_SETMASK' undeclared (first use in this function)
    sig.c: In Funktion »sig_init«:
    sig.c:122: error: `SIG_BLOCK' undeclared (first use in this function)
    sig.c:126: error: dereferencing pointer to incomplete type
    sig.c:126: error: `sig_t' undeclared (first use in this function)
    sig.c:126: error: Syntaxfehler before ')' token
    sig.c:127: error: dereferencing pointer to incomplete type
    sig.c:130: error: dereferencing pointer to incomplete type
    sig.c:132: error: `SIG_SETMASK' undeclared (first use in this function)
    sig.c: In Funktion »sig_end«:
    sig.c:145: error: dereferencing pointer to incomplete type
    sig.c:146: error: dereferencing pointer to incomplete type
    sig.c: In Funktion »sig_set«:
    sig.c:163: error: `SIG_BLOCK' undeclared (first use in this function)
    sig.c:166: error: `sig_t' undeclared (first use in this function)
    sig.c:166: error: Syntaxfehler before "s"
    sig.c:168: error: `s' undeclared (first use in this function)
    sig.c:169: error: dereferencing pointer to incomplete type
    sig.c:172: error: `SIG_SETMASK' undeclared (first use in this function)
    sig.c: In Funktion »sig_clr«:
    sig.c:189: error: `SIG_BLOCK' undeclared (first use in this function)
    sig.c:192: error: dereferencing pointer to incomplete type
    sig.c:193: error: dereferencing pointer to incomplete type
    sig.c:197: error: `SIG_SETMASK' undeclared (first use in this function)
    In file included from editline.c:18:
    term.c: In Funktion »term_setflags«:
    term.c:295: error: dereferencing pointer to incomplete type
    term.c:296: error: dereferencing pointer to incomplete type
    term.c:297: error: dereferencing pointer to incomplete type
    term.c:297: error: dereferencing pointer to incomplete type
    term.c:297: error: dereferencing pointer to incomplete type
    term.c:299: error: dereferencing pointer to incomplete type
    term.c:299: error: dereferencing pointer to incomplete type
    term.c:299: error: dereferencing pointer to incomplete type
    term.c:300: error: dereferencing pointer to incomplete type
    term.c:300: error: dereferencing pointer to incomplete type
    term.c:300: error: dereferencing pointer to incomplete type
    term.c:301: error: dereferencing pointer to incomplete type
    term.c:301: error: dereferencing pointer to incomplete type
    term.c:301: error: dereferencing pointer to incomplete type
    term.c:301: error: dereferencing pointer to incomplete type
    term.c:301: error: dereferencing pointer to incomplete type
    term.c:302: error: dereferencing pointer to incomplete type
    term.c:302: error: dereferencing pointer to incomplete type
    term.c:302: error: dereferencing pointer to incomplete type
    term.c:302: error: dereferencing pointer to incomplete type
    term.c:302: error: dereferencing pointer to incomplete type
    term.c:302: error: dereferencing pointer to incomplete type
    term.c:302: error: dereferencing pointer to incomplete type
    term.c:304: error: dereferencing pointer to incomplete type
    term.c:304: error: dereferencing pointer to incomplete type
    term.c:304: error: dereferencing pointer to incomplete type
    term.c:304: error: dereferencing pointer to incomplete type
    term.c:304: error: dereferencing pointer to incomplete type
    term.c:305: error: dereferencing pointer to incomplete type
    term.c:305: error: dereferencing pointer to incomplete type
    term.c:306: error: dereferencing pointer to incomplete type
    term.c:306: error: dereferencing pointer to incomplete type
    term.c:308: error: dereferencing pointer to incomplete type
    term.c:308: error: dereferencing pointer to incomplete type
    term.c:308: error: dereferencing pointer to incomplete type
    term.c:308: error: dereferencing pointer to incomplete type
    term.c:309: error: dereferencing pointer to incomplete type
    term.c:309: error: dereferencing pointer to incomplete type
    term.c:309: error: dereferencing pointer to incomplete type
    term.c:309: error: dereferencing pointer to incomplete type
    term.c:309: error: dereferencing pointer to incomplete type
    term.c:309: error: dereferencing pointer to incomplete type
    term.c:309: error: dereferencing pointer to incomplete type
    term.c:309: error: dereferencing pointer to incomplete type
    term.c:309: error: dereferencing pointer to incomplete type
    term.c:309: error: dereferencing pointer to incomplete type
    term.c:309: error: dereferencing pointer to incomplete type
    term.c:309: error: dereferencing pointer to incomplete type
    term.c:309: error: dereferencing pointer to incomplete type
    term.c:309: error: dereferencing pointer to incomplete type
    term.c:309: error: dereferencing pointer to incomplete type
    term.c:309: error: dereferencing pointer to incomplete type
    term.c:309: error: dereferencing pointer to incomplete type
    term.c:309: error: dereferencing pointer to incomplete type
    term.c:309: error: dereferencing pointer to incomplete type
    term.c:309: error: dereferencing pointer to incomplete type
    term.c:309: error: dereferencing pointer to incomplete type
    term.c:309: error: dereferencing pointer to incomplete type
    term.c:309: error: dereferencing pointer to incomplete type
    term.c:309: error: dereferencing pointer to incomplete type
    term.c:309: error: dereferencing pointer to incomplete type
    term.c:309: error: dereferencing pointer to incomplete type
    term.c:309: error: dereferencing pointer to incomplete type
    term.c:309: error: dereferencing pointer to incomplete type
    term.c:309: error: dereferencing pointer to incomplete type
    term.c:309: error: dereferencing pointer to incomplete type
    term.c:309: error: dereferencing pointer to incomplete type
    term.c:309: error: dereferencing pointer to incomplete type
    term.c:309: error: dereferencing pointer to incomplete type
    term.c:309: error: dereferencing pointer to incomplete type
    term.c:309: error: dereferencing pointer to incomplete type
    term.c:309: error: dereferencing pointer to incomplete type
    term.c:309: error: dereferencing pointer to incomplete type
    term.c:309: error: dereferencing pointer to incomplete type
    term.c:309: error: dereferencing pointer to incomplete type
    term.c:309: error: dereferencing pointer to incomplete type
    term.c:309: error: dereferencing pointer to incomplete type
    term.c:309: error: dereferencing pointer to incomplete type
    term.c:309: error: dereferencing pointer to incomplete type
    term.c:309: error: dereferencing pointer to incomplete type
    term.c:309: error: dereferencing pointer to incomplete type
    term.c:309: error: dereferencing pointer to incomplete type
    term.c:309: error: dereferencing pointer to incomplete type
    term.c:309: error: dereferencing pointer to incomplete type
    term.c:309: error: dereferencing pointer to incomplete type
    term.c:309: error: dereferencing pointer to incomplete type
    term.c:309: error: dereferencing pointer to incomplete type
    term.c:309: error: dereferencing pointer to incomplete type
    term.c:309: error: dereferencing pointer to incomplete type
    term.c:312: error: dereferencing pointer to incomplete type
    term.c:313: error: dereferencing pointer to incomplete type
    term.c:313: error: dereferencing pointer to incomplete type
    term.c:313: error: dereferencing pointer to incomplete type
    term.c:313: error: dereferencing pointer to incomplete type
    term.c:314: error: dereferencing pointer to incomplete type
    term.c:314: error: dereferencing pointer to incomplete type
    term.c:314: error: dereferencing pointer to incomplete type
    term.c:314: error: dereferencing pointer to incomplete type
    term.c:314: error: dereferencing pointer to incomplete type
    term.c:314: error: dereferencing pointer to incomplete type
    term.c:314: error: dereferencing pointer to incomplete type
    term.c:314: error: dereferencing pointer to incomplete type
    term.c:314: error: dereferencing pointer to incomplete type
    term.c:314: error: dereferencing pointer to incomplete type
    term.c:314: error: dereferencing pointer to incomplete type
    term.c:314: error: dereferencing pointer to incomplete type
    term.c:314: error: dereferencing pointer to incomplete type
    term.c:314: error: dereferencing pointer to incomplete type
    term.c:314: error: dereferencing pointer to incomplete type
    term.c:314: error: dereferencing pointer to incomplete type
    term.c:314: error: dereferencing pointer to incomplete type
    term.c:314: error: dereferencing pointer to incomplete type
    term.c:314: error: dereferencing pointer to incomplete type
    term.c:314: error: dereferencing pointer to incomplete type
    term.c:314: error: dereferencing pointer to incomplete type
    term.c:314: error: dereferencing pointer to incomplete type
    term.c:314: error: dereferencing pointer to incomplete type
    term.c:314: error: dereferencing pointer to incomplete type
    term.c:314: error: dereferencing pointer to incomplete type
    term.c:314: error: dereferencing pointer to incomplete type
    term.c:314: error: dereferencing pointer to incomplete type
    term.c:314: error: dereferencing pointer to incomplete type
    term.c:314: error: dereferencing pointer to incomplete type
    term.c:314: error: dereferencing pointer to incomplete type
    term.c:314: error: dereferencing pointer to incomplete type
    term.c:314: error: dereferencing pointer to incomplete type
    term.c:314: error: dereferencing pointer to incomplete type
    term.c:314: error: dereferencing pointer to incomplete type
    term.c:314: error: dereferencing pointer to incomplete type
    term.c:314: error: dereferencing pointer to incomplete type
    term.c:314: error: dereferencing pointer to incomplete type
    term.c:314: error: dereferencing pointer to incomplete type
    term.c:314: error: dereferencing pointer to incomplete type
    term.c:314: error: dereferencing pointer to incomplete type
    term.c:314: error: dereferencing pointer to incomplete type
    term.c:314: error: dereferencing pointer to incomplete type
    term.c:314: error: dereferencing pointer to incomplete type
    term.c:314: error: dereferencing pointer to incomplete type
    term.c:314: error: dereferencing pointer to incomplete type
    term.c:314: error: dereferencing pointer to incomplete type
    term.c:314: error: dereferencing pointer to incomplete type
    term.c:314: error: dereferencing pointer to incomplete type
    term.c:314: error: dereferencing pointer to incomplete type
    term.c:314: error: dereferencing pointer to incomplete type
    term.c:314: error: dereferencing pointer to incomplete type
    term.c:314: error: dereferencing pointer to incomplete type
    term.c:314: error: dereferencing pointer to incomplete type
    term.c: In Funktion »term_init«:
    term.c:342: error: dereferencing pointer to incomplete type
    term.c:343: error: dereferencing pointer to incomplete type
    term.c:345: error: dereferencing pointer to incomplete type
    term.c:346: error: dereferencing pointer to incomplete type
    term.c:348: error: dereferencing pointer to incomplete type
    term.c:349: error: dereferencing pointer to incomplete type
    term.c:351: error: dereferencing pointer to incomplete type
    term.c:352: error: dereferencing pointer to incomplete type
    term.c:353: error: dereferencing pointer to incomplete type
    term.c:355: error: dereferencing pointer to incomplete type
    term.c:355: error: dereferencing pointer to incomplete type
    term.c:355: error: dereferencing pointer to incomplete type
    term.c:355: error: dereferencing pointer to incomplete type
    term.c:356: error: dereferencing pointer to incomplete type
    term.c:357: error: dereferencing pointer to incomplete type
    term.c:359: error: dereferencing pointer to incomplete type
    term.c:359: error: dereferencing pointer to incomplete type
    term.c:359: error: dereferencing pointer to incomplete type
    term.c:359: error: dereferencing pointer to incomplete type
    term.c:360: error: dereferencing pointer to incomplete type
    term.c: In Funktion »term_end«:
    term.c:372: error: dereferencing pointer to incomplete type
    term.c:373: error: dereferencing pointer to incomplete type
    term.c:374: error: dereferencing pointer to incomplete type
    term.c:375: error: dereferencing pointer to incomplete type
    term.c:376: error: dereferencing pointer to incomplete type
    term.c:377: error: dereferencing pointer to incomplete type
    term.c:378: error: dereferencing pointer to incomplete type
    term.c:379: error: dereferencing pointer to incomplete type
    term.c:380: error: dereferencing pointer to incomplete type
    term.c:381: error: dereferencing pointer to incomplete type
    term.c:382: error: dereferencing pointer to incomplete type
    term.c: In Funktion »term_alloc«:
    term.c:395: error: dereferencing pointer to incomplete type
    term.c:416: error: dereferencing pointer to incomplete type
    term.c:418: error: dereferencing pointer to incomplete type
    term.c:418: error: dereferencing pointer to incomplete type
    term.c:420: error: dereferencing pointer to incomplete type
    term.c:436: error: dereferencing pointer to incomplete type
    term.c:437: error: dereferencing pointer to incomplete type
    term.c:438: error: dereferencing pointer to incomplete type
    term.c:439: error: dereferencing pointer to incomplete type
    term.c:444: error: dereferencing pointer to incomplete type
    term.c:444: error: dereferencing pointer to incomplete type
    term.c:445: error: dereferencing pointer to incomplete type
    term.c: In Funktion »term_rebuffer_display«:
    term.c:456: error: dereferencing pointer to incomplete type
    term.c:460: error: dereferencing pointer to incomplete type
    term.c:461: error: dereferencing pointer to incomplete type
    term.c: In Funktion »term_alloc_display«:
    term.c:477: error: dereferencing pointer to incomplete type
    term.c:488: error: dereferencing pointer to incomplete type
    term.c:499: error: dereferencing pointer to incomplete type
    term.c: In Funktion »term_free_display«:
    term.c:513: error: dereferencing pointer to incomplete type
    term.c:514: error: dereferencing pointer to incomplete type
    term.c:520: error: dereferencing pointer to incomplete type
    term.c:521: error: dereferencing pointer to incomplete type
    term.c: In Funktion »term_move_to_line«:
    term.c:539: error: dereferencing pointer to incomplete type
    term.c:542: error: dereferencing pointer to incomplete type
    term.c:549: error: dereferencing pointer to incomplete type
    term.c:551: error: dereferencing pointer to incomplete type
    term.c:552: error: dereferencing pointer to incomplete type
    term.c:552: error: dereferencing pointer to incomplete type
    term.c:554: error: dereferencing pointer to incomplete type
    term.c:556: error: dereferencing pointer to incomplete type
    term.c:556: error: dereferencing pointer to incomplete type
    term.c:556: error: dereferencing pointer to incomplete type
    term.c:561: error: dereferencing pointer to incomplete type
    term.c:561: error: dereferencing pointer to incomplete type
    term.c:562: error: dereferencing pointer to incomplete type
    term.c:569: error: dereferencing pointer to incomplete type
    term.c:574: error: dereferencing pointer to incomplete type
    term.c:574: error: dereferencing pointer to incomplete type
    term.c:574: error: dereferencing pointer to incomplete type
    term.c:574: error: dereferencing pointer to incomplete type
    term.c:575: error: dereferencing pointer to incomplete type
    term.c:578: error: dereferencing pointer to incomplete type
    term.c:578: error: dereferencing pointer to incomplete type
    term.c:580: error: dereferencing pointer to incomplete type
    term.c:583: error: dereferencing pointer to incomplete type
    term.c: In Funktion »term_move_to_char«:
    term.c:596: error: dereferencing pointer to incomplete type
    term.c:599: error: dereferencing pointer to incomplete type
    term.c:608: error: dereferencing pointer to incomplete type
    term.c:611: error: dereferencing pointer to incomplete type
    term.c:613: error: dereferencing pointer to incomplete type
    term.c:613: error: dereferencing pointer to incomplete type
    term.c:615: error: dereferencing pointer to incomplete type
    term.c:618: error: dereferencing pointer to incomplete type
    term.c:618: error: dereferencing pointer to incomplete type
    term.c:619: error: dereferencing pointer to incomplete type
    term.c:623: error: dereferencing pointer to incomplete type
    term.c:624: error: dereferencing pointer to incomplete type
    term.c:628: error: dereferencing pointer to incomplete type
    term.c:633: error: dereferencing pointer to incomplete type
    term.c:645: error: dereferencing pointer to incomplete type
    term.c:645: error: dereferencing pointer to incomplete type
    term.c:645: error: dereferencing pointer to incomplete type
    term.c:646: error: dereferencing pointer to incomplete type
    term.c:650: error: dereferencing pointer to incomplete type
    term.c:650: error: dereferencing pointer to incomplete type
    term.c:651: error: dereferencing pointer to incomplete type
    term.c:658: error: dereferencing pointer to incomplete type
    term.c:663: error: dereferencing pointer to incomplete type
    term.c:671: error: dereferencing pointer to incomplete type
    term.c: In Funktion »term_overwrite«:
    term.c:684: error: dereferencing pointer to incomplete type
    term.c:693: error: dereferencing pointer to incomplete type
    term.c:696: error: dereferencing pointer to incomplete type
    term.c:696: error: dereferencing pointer to incomplete type
    term.c:697: error: dereferencing pointer to incomplete type
    term.c:698: error: dereferencing pointer to incomplete type
    term.c:699: error: dereferencing pointer to incomplete type
    term.c:700: error: dereferencing pointer to incomplete type
    term.c:704: error: dereferencing pointer to incomplete type
    term.c:704: error: dereferencing pointer to incomplete type
    term.c:704: error: dereferencing pointer to incomplete type
    term.c:709: error: dereferencing pointer to incomplete type
    term.c:712: error: dereferencing pointer to incomplete type
    term.c:712: error: dereferencing pointer to incomplete type
    term.c: In Funktion »term_deletechars«:
    term.c:726: error: dereferencing pointer to incomplete type
    term.c:732: error: dereferencing pointer to incomplete type
    term.c:739: error: dereferencing pointer to incomplete type
    term.c:739: error: dereferencing pointer to incomplete type
    term.c:740: error: dereferencing pointer to incomplete type
    term.c:740: error: dereferencing pointer to incomplete type
    term.c:742: error: dereferencing pointer to incomplete type
    term.c:746: error: dereferencing pointer to incomplete type
    term.c:746: error: dereferencing pointer to incomplete type
    term.c:747: error: dereferencing pointer to incomplete type
    term.c:749: error: dereferencing pointer to incomplete type
    term.c:749: error: dereferencing pointer to incomplete type
    term.c:751: error: dereferencing pointer to incomplete type
    term.c:753: error: dereferencing pointer to incomplete type
    term.c:753: error: dereferencing pointer to incomplete type
    term.c:754: error: dereferencing pointer to incomplete type
    term.c: In Funktion »term_insertwrite«:
    term.c:767: error: dereferencing pointer to incomplete type
    term.c:773: error: dereferencing pointer to incomplete type
    term.c:780: error: dereferencing pointer to incomplete type
    term.c:780: error: dereferencing pointer to incomplete type
    term.c:781: error: dereferencing pointer to incomplete type
    term.c:781: error: dereferencing pointer to incomplete type
    term.c:783: error: dereferencing pointer to incomplete type
    term.c:789: error: dereferencing pointer to incomplete type
    term.c:789: error: dereferencing pointer to incomplete type
    term.c:789: error: dereferencing pointer to incomplete type
    term.c:789: error: dereferencing pointer to incomplete type
    term.c:790: error: dereferencing pointer to incomplete type
    term.c:792: error: dereferencing pointer to incomplete type
    term.c:797: error: dereferencing pointer to incomplete type
    term.c:797: error: dereferencing pointer to incomplete type
    term.c:798: error: dereferencing pointer to incomplete type
    term.c:800: error: dereferencing pointer to incomplete type
    term.c:804: error: dereferencing pointer to incomplete type
    term.c:804: error: dereferencing pointer to incomplete type
    term.c:805: error: dereferencing pointer to incomplete type
    term.c:810: error: dereferencing pointer to incomplete type
    term.c:812: error: dereferencing pointer to incomplete type
    term.c:812: error: dereferencing pointer to incomplete type
    term.c:813: error: dereferencing pointer to incomplete type
    term.c: In Funktion »term_clear_EOL«:
    term.c:828: error: dereferencing pointer to incomplete type
    term.c:828: error: dereferencing pointer to incomplete type
    term.c:828: error: dereferencing pointer to incomplete type
    term.c:829: error: dereferencing pointer to incomplete type
    term.c:833: error: dereferencing pointer to incomplete type
    term.c: In Funktion »term_clear_screen«:
    term.c:845: error: dereferencing pointer to incomplete type
    term.c:845: error: dereferencing pointer to incomplete type
    term.c:847: error: dereferencing pointer to incomplete type
    term.c:847: error: dereferencing pointer to incomplete type
    term.c:848: error: dereferencing pointer to incomplete type
    term.c:848: error: dereferencing pointer to incomplete type
    term.c:848: error: dereferencing pointer to incomplete type
    term.c:848: error: dereferencing pointer to incomplete type
    term.c:849: error: dereferencing pointer to incomplete type
    term.c:849: error: dereferencing pointer to incomplete type
    term.c:851: error: dereferencing pointer to incomplete type
    term.c:851: error: dereferencing pointer to incomplete type
    term.c: In Funktion »term_beep«:
    term.c:865: error: dereferencing pointer to incomplete type
    term.c:865: error: dereferencing pointer to incomplete type
    term.c:867: error: dereferencing pointer to incomplete type
    term.c: In Funktion »term_set«:
    term.c:903: error: `SIG_BLOCK' undeclared (first use in this function)
    term.c:915: error: dereferencing pointer to incomplete type
    term.c:917: error: dereferencing pointer to incomplete type
    term.c:917: error: dereferencing pointer to incomplete type
    term.c:917: error: dereferencing pointer to incomplete type
    term.c:917: error: dereferencing pointer to incomplete type
    term.c:919: error: dereferencing pointer to incomplete type
    term.c:923: error: dereferencing pointer to incomplete type
    term.c:926: error: dereferencing pointer to incomplete type
    term.c:928: error: dereferencing pointer to incomplete type
    term.c:930: error: dereferencing pointer to incomplete type
    term.c:931: error: dereferencing pointer to incomplete type
    term.c:931: error: dereferencing pointer to incomplete type
    term.c:931: error: dereferencing pointer to incomplete type
    term.c:932: error: dereferencing pointer to incomplete type
    term.c:932: error: dereferencing pointer to incomplete type
    term.c:937: error: dereferencing pointer to incomplete type
    term.c:938: error: dereferencing pointer to incomplete type
    term.c:940: error: dereferencing pointer to incomplete type
    term.c:941: error: dereferencing pointer to incomplete type
    term.c:943: error: dereferencing pointer to incomplete type
    term.c:944: error: dereferencing pointer to incomplete type
    term.c:946: error: dereferencing pointer to incomplete type
    term.c:947: error: dereferencing pointer to incomplete type
    term.c:952: error: dereferencing pointer to incomplete type
    term.c:953: error: dereferencing pointer to incomplete type
    term.c:954: error: dereferencing pointer to incomplete type
    term.c:955: error: dereferencing pointer to incomplete type
    term.c:957: error: dereferencing pointer to incomplete type
    term.c:957: error: dereferencing pointer to incomplete type
    term.c:958: error: dereferencing pointer to incomplete type
    term.c:958: error: dereferencing pointer to incomplete type
    term.c:966: error: `SIG_SETMASK' undeclared (first use in this function)
    term.c: In Funktion »term_get_size«:
    term.c:980: error: dereferencing pointer to incomplete type
    term.c:981: error: dereferencing pointer to incomplete type
    term.c:986: error: dereferencing pointer to incomplete type
    term.c:1005: error: dereferencing pointer to incomplete type
    term.c:1005: error: dereferencing pointer to incomplete type
    term.c: In Funktion »term_change_size«:
    term.c:1018: error: dereferencing pointer to incomplete type
    term.c:1019: error: dereferencing pointer to incomplete type
    term.c: In Funktion »term_init_arrow«:
    term.c:1035: error: dereferencing pointer to incomplete type
    term.c: In Funktion »term_reset_arrow«:
    term.c:1075: error: dereferencing pointer to incomplete type
    term.c:1102: error: dereferencing pointer to incomplete type
    term.c: In Funktion »term_set_arrow«:
    term.c:1125: error: dereferencing pointer to incomplete type
    term.c: In Funktion »term_clear_arrow«:
    term.c:1144: error: dereferencing pointer to incomplete type
    term.c: In Funktion »term_print_arrow«:
    term.c:1163: error: dereferencing pointer to incomplete type
    term.c: In Funktion »term_bind_arrow«:
    term.c:1183: error: dereferencing pointer to incomplete type
    term.c:1186: error: dereferencing pointer to incomplete type
    term.c:1186: error: dereferencing pointer to incomplete type
    term.c:1189: error: dereferencing pointer to incomplete type
    term.c:1189: error: dereferencing pointer to incomplete type
    term.c:1189: error: dereferencing pointer to incomplete type
    term.c:1190: error: dereferencing pointer to incomplete type
    term.c:1190: error: dereferencing pointer to incomplete type
    term.c:1190: error: dereferencing pointer to incomplete type
    term.c:1195: error: dereferencing pointer to incomplete type
    term.c: In Funktion »term_telltc«:
    term.c:1263: error: dereferencing pointer to incomplete type
    term.c:1264: error: dereferencing pointer to incomplete type
    term.c:1265: error: dereferencing pointer to incomplete type
    term.c:1266: error: dereferencing pointer to incomplete type
    term.c:1266: error: dereferencing pointer to incomplete type
    term.c:1267: error: dereferencing pointer to incomplete type
    term.c:1268: error: dereferencing pointer to incomplete type
    term.c:1269: error: dereferencing pointer to incomplete type
    term.c:1270: error: dereferencing pointer to incomplete type
    term.c:1271: error: dereferencing pointer to incomplete type
    term.c:1272: error: dereferencing pointer to incomplete type
    term.c:1273: error: dereferencing pointer to incomplete type
    term.c:1274: error: dereferencing pointer to incomplete type
    term.c:1275: error: dereferencing pointer to incomplete type
    term.c:1277: error: dereferencing pointer to incomplete type
    term.c:1278: error: dereferencing pointer to incomplete type
    term.c:1282: error: dereferencing pointer to incomplete type
    term.c: In Funktion »term_settc«:
    term.c:1327: error: dereferencing pointer to incomplete type
    term.c:1329: error: dereferencing pointer to incomplete type
    term.c:1331: error: dereferencing pointer to incomplete type
    term.c:1336: error: dereferencing pointer to incomplete type
    term.c:1336: error: dereferencing pointer to incomplete type
    term.c:1345: error: dereferencing pointer to incomplete type
    term.c:1349: error: dereferencing pointer to incomplete type
    term.c:1350: error: dereferencing pointer to incomplete type
    term.c:1350: error: dereferencing pointer to incomplete type
    term.c:1351: error: dereferencing pointer to incomplete type
    term.c:1351: error: dereferencing pointer to incomplete type
    term.c:1353: error: dereferencing pointer to incomplete type
    term.c:1353: error: dereferencing pointer to incomplete type
    term.c: In Funktion »term_echotc«:
    term.c:1402: error: dereferencing pointer to incomplete type
    term.c:1402: error: dereferencing pointer to incomplete type
    term.c:1405: error: dereferencing pointer to incomplete type
    term.c:1405: error: dereferencing pointer to incomplete type
    term.c:1408: error: dereferencing pointer to incomplete type
    term.c:1408: error: dereferencing pointer to incomplete type
    term.c:1412: error: dereferencing pointer to incomplete type
    term.c:1412: error: dereferencing pointer to incomplete type
    term.c:1427: error: dereferencing pointer to incomplete type
    term.c:1427: error: dereferencing pointer to incomplete type
    term.c:1431: error: dereferencing pointer to incomplete type
    term.c:1431: error: dereferencing pointer to incomplete type
    term.c:1434: error: dereferencing pointer to incomplete type
    term.c:1434: error: dereferencing pointer to incomplete type
    term.c:1443: error: dereferencing pointer to incomplete type
    term.c:1450: error: dereferencing pointer to incomplete type
    term.c:1481: error: dereferencing pointer to incomplete type
    term.c:1493: error: dereferencing pointer to incomplete type
    term.c:1504: error: dereferencing pointer to incomplete type
    term.c:1512: error: dereferencing pointer to incomplete type
    term.c:1521: error: dereferencing pointer to incomplete type
    term.c:1531: error: dereferencing pointer to incomplete type
    term.c:1539: error: dereferencing pointer to incomplete type
    term.c:1546: error: dereferencing pointer to incomplete type
    term.c:1555: error: dereferencing pointer to incomplete type
    term.c:1562: error: dereferencing pointer to incomplete type
    term.c:1570: error: dereferencing pointer to incomplete type
    term.c:1577: error: dereferencing pointer to incomplete type
    In file included from editline.c:19:
    tty.c: Auf höchster Ebene:
    tty.c:56: error: Syntaxfehler before "u_int"
    tty.c:56: Warnung: kein Semikolon am Ende von »struct« oder »union«
    tty.c:58: error: Syntaxfehler before '}' token
    tty.c:58: Warnung: data definition has no type or storage class
    tty.c:66: error: Syntaxfehler before "ttyperm"
    tty.c:67: Warnung: geschweifte Klammern um Skalar-Initialisierung
    tty.c:67: Warnung: (near initialization for `ttyperm')
    tty.c:68: Warnung: geschweifte Klammern um Skalar-Initialisierung
    tty.c:68: Warnung: (near initialization for `ttyperm')
    tty.c:68: Warnung: Initialisierung erzeugt Ganzzahl von Zeiger ohne Typkonvertierung
    tty.c:68: Warnung: Elementüberschreitung in Skalar-Initialisierung
    tty.c:68: Warnung: (nahe der Initialisierung für »ttyperm«)
    tty.c:68: Warnung: Elementüberschreitung in Skalar-Initialisierung
    tty.c:68: Warnung: (nahe der Initialisierung für »ttyperm«)
    tty.c:69: Warnung: geschweifte Klammern um Skalar-Initialisierung
    tty.c:69: Warnung: (near initialization for `ttyperm')
    tty.c:69: Warnung: Initialisierung erzeugt Ganzzahl von Zeiger ohne Typkonvertierung
    tty.c:69: Warnung: Elementüberschreitung in Skalar-Initialisierung
    tty.c:69: Warnung: (nahe der Initialisierung für »ttyperm«)
    tty.c:69: Warnung: Elementüberschreitung in Skalar-Initialisierung
    tty.c:69: Warnung: (nahe der Initialisierung für »ttyperm«)
    tty.c:69: Warnung: Elementüberschreitung in Skalar-Initialisierung
    tty.c:69: Warnung: (nahe der Initialisierung für »ttyperm«)
    tty.c:70: Warnung: geschweifte Klammern um Skalar-Initialisierung
    tty.c:70: Warnung: (near initialization for `ttyperm')
    tty.c:70: Warnung: Initialisierung erzeugt Ganzzahl von Zeiger ohne Typkonvertierung
    tty.c:70: Warnung: Elementüberschreitung in Skalar-Initialisierung
    tty.c:70: Warnung: (nahe der Initialisierung für »ttyperm«)
    tty.c:70: Warnung: Elementüberschreitung in Skalar-Initialisierung
    tty.c:70: Warnung: (nahe der Initialisierung für »ttyperm«)
    tty.c:70: Warnung: Elementüberschreitung in Skalar-Initialisierung
    tty.c:70: Warnung: (nahe der Initialisierung für »ttyperm«)
    tty.c:71: Warnung: geschweifte Klammern um Skalar-Initialisierung
    tty.c:71: Warnung: (near initialization for `ttyperm')
    tty.c:71: Warnung: Initialisierung erzeugt Ganzzahl von Zeiger ohne Typkonvertierung
    tty.c:71: Warnung: Elementüberschreitung in Skalar-Initialisierung
    tty.c:71: Warnung: (nahe der Initialisierung für »ttyperm«)
    tty.c:72: Warnung: Elementüberschreitung in Skalar-Initialisierung
    tty.c:72: Warnung: (nahe der Initialisierung für »ttyperm«)
    tty.c:72: Warnung: Elementüberschreitung in Skalar-Initialisierung
    tty.c:72: Warnung: (nahe der Initialisierung für »ttyperm«)
    tty.c:73: Warnung: geschweifte Klammern um Skalar-Initialisierung
    tty.c:73: Warnung: (near initialization for `ttyperm')
    tty.c:73: Warnung: Initialisierung erzeugt Ganzzahl von Zeiger ohne Typkonvertierung
    tty.c:73: Warnung: Elementüberschreitung in Skalar-Initialisierung
    tty.c:73: Warnung: (nahe der Initialisierung für »ttyperm«)
    tty.c:73: Warnung: Elementüberschreitung in Skalar-Initialisierung
    tty.c:73: Warnung: (nahe der Initialisierung für »ttyperm«)
    tty.c:73: Warnung: Elementüberschreitung in Skalar-Initialisierung
    tty.c:73: Warnung: (nahe der Initialisierung für »ttyperm«)
    tty.c:75: Warnung: geschweifte Klammern um Skalar-Initialisierung
    tty.c:75: Warnung: (near initialization for `ttyperm')
    tty.c:76: Warnung: geschweifte Klammern um Skalar-Initialisierung
    tty.c:76: Warnung: (near initialization for `ttyperm')
    tty.c:76: Warnung: Initialisierung erzeugt Ganzzahl von Zeiger ohne Typkonvertierung
    tty.c:76: Warnung: Elementüberschreitung in Skalar-Initialisierung
    tty.c:76: Warnung: (nahe der Initialisierung für »ttyperm«)
    tty.c:76: Warnung: Elementüberschreitung in Skalar-Initialisierung
    tty.c:76: Warnung: (nahe der Initialisierung für »ttyperm«)
    tty.c:77: Warnung: geschweifte Klammern um Skalar-Initialisierung
    tty.c:77: Warnung: (near initialization for `ttyperm')
    tty.c:77: Warnung: Initialisierung erzeugt Ganzzahl von Zeiger ohne Typkonvertierung
    tty.c:77: Warnung: Elementüberschreitung in Skalar-Initialisierung
    tty.c:77: Warnung: (nahe der Initialisierung für »ttyperm«)
    tty.c:77: Warnung: Elementüberschreitung in Skalar-Initialisierung
    tty.c:77: Warnung: (nahe der Initialisierung für »ttyperm«)
    tty.c:77: Warnung: Elementüberschreitung in Skalar-Initialisierung
    tty.c:77: Warnung: (nahe der Initialisierung für »ttyperm«)
    tty.c:78: Warnung: geschweifte Klammern um Skalar-Initialisierung
    tty.c:78: Warnung: (near initialization for `ttyperm')
    tty.c:78: Warnung: Initialisierung erzeugt Ganzzahl von Zeiger ohne Typkonvertierung
    tty.c:78: Warnung: Elementüberschreitung in Skalar-Initialisierung
    tty.c:78: Warnung: (nahe der Initialisierung für »ttyperm«)
    tty.c:78: Warnung: Elementüberschreitung in Skalar-Initialisierung
    tty.c:78: Warnung: (nahe der Initialisierung für »ttyperm«)
    tty.c:78: Warnung: Elementüberschreitung in Skalar-Initialisierung
    tty.c:78: Warnung: (nahe der Initialisierung für »ttyperm«)
    tty.c:79: Warnung: geschweifte Klammern um Skalar-Initialisierung
    tty.c:79: Warnung: (near initialization for `ttyperm')
    tty.c:79: Warnung: Initialisierung erzeugt Ganzzahl von Zeiger ohne Typkonvertierung
    tty.c:79: Warnung: Elementüberschreitung in Skalar-Initialisierung
    tty.c:79: Warnung: (nahe der Initialisierung für »ttyperm«)
    tty.c:80: Warnung: Elementüberschreitung in Skalar-Initialisierung
    tty.c:80: Warnung: (nahe der Initialisierung für »ttyperm«)
    tty.c:80: Warnung: Elementüberschreitung in Skalar-Initialisierung
    tty.c:80: Warnung: (nahe der Initialisierung für »ttyperm«)
    tty.c:81: Warnung: geschweifte Klammern um Skalar-Initialisierung
    tty.c:81: Warnung: (near initialization for `ttyperm')
    tty.c:81: Warnung: Initialisierung erzeugt Ganzzahl von Zeiger ohne Typkonvertierung
    tty.c:83: Warnung: Elementüberschreitung in Skalar-Initialisierung
    tty.c:83: Warnung: (nahe der Initialisierung für »ttyperm«)
    tty.c:83: Warnung: Elementüberschreitung in Skalar-Initialisierung
    tty.c:83: Warnung: (nahe der Initialisierung für »ttyperm«)
    tty.c:83: Warnung: Elementüberschreitung in Skalar-Initialisierung
    tty.c:83: Warnung: (nahe der Initialisierung für »ttyperm«)
    tty.c:84: Warnung: Elementüberschreitung in Skalar-Initialisierung
    tty.c:84: Warnung: (nahe der Initialisierung für »ttyperm«)
    tty.c:85: Warnung: geschweifte Klammern um Skalar-Initialisierung
    tty.c:85: Warnung: (near initialization for `ttyperm')
    tty.c:86: Warnung: geschweifte Klammern um Skalar-Initialisierung
    tty.c:86: Warnung: (near initialization for `ttyperm')
    tty.c:86: Warnung: Initialisierung erzeugt Ganzzahl von Zeiger ohne Typkonvertierung
    tty.c:86: Warnung: Elementüberschreitung in Skalar-Initialisierung
    tty.c:86: Warnung: (nahe der Initialisierung für »ttyperm«)
    tty.c:86: Warnung: Elementüberschreitung in Skalar-Initialisierung
    tty.c:86: Warnung: (nahe der Initialisierung für »ttyperm«)
    tty.c:87: Warnung: geschweifte Klammern um Skalar-Initialisierung
    tty.c:87: Warnung: (near initialization for `ttyperm')
    tty.c:87: Warnung: Initialisierung erzeugt Ganzzahl von Zeiger ohne Typkonvertierung
    tty.c:87: Warnung: Elementüberschreitung in Skalar-Initialisierung
    tty.c:87: Warnung: (nahe der Initialisierung für »ttyperm«)
    tty.c:87: Warnung: Elementüberschreitung in Skalar-Initialisierung
    tty.c:87: Warnung: (nahe der Initialisierung für »ttyperm«)
    tty.c:87: Warnung: Elementüberschreitung in Skalar-Initialisierung
    tty.c:87: Warnung: (nahe der Initialisierung für »ttyperm«)
    tty.c:88: Warnung: geschweifte Klammern um Skalar-Initialisierung
    tty.c:88: Warnung: (near initialization for `ttyperm')
    tty.c:88: Warnung: Initialisierung erzeugt Ganzzahl von Zeiger ohne Typkonvertierung
    tty.c:88: Warnung: Elementüberschreitung in Skalar-Initialisierung
    tty.c:88: Warnung: (nahe der Initialisierung für »ttyperm«)
    tty.c:88: Warnung: Elementüberschreitung in Skalar-Initialisierung
    tty.c:88: Warnung: (nahe der Initialisierung für »ttyperm«)
    tty.c:88: Warnung: Elementüberschreitung in Skalar-Initialisierung
    tty.c:88: Warnung: (nahe der Initialisierung für »ttyperm«)
    tty.c:89: Warnung: geschweifte Klammern um Skalar-Initialisierung
    tty.c:89: Warnung: (near initialization for `ttyperm')
    tty.c:89: Warnung: Initialisierung erzeugt Ganzzahl von Zeiger ohne Typkonvertierung
    tty.c:89: Warnung: Elementüberschreitung in Skalar-Initialisierung
    tty.c:89: Warnung: (nahe der Initialisierung für »ttyperm«)
    tty.c:89: Warnung: Elementüberschreitung in Skalar-Initialisierung
    tty.c:89: Warnung: (nahe der Initialisierung für »ttyperm«)
    tty.c:89: Warnung: Elementüberschreitung in Skalar-Initialisierung
    tty.c:89: Warnung: (nahe der Initialisierung für »ttyperm«)
    tty.c:90: Warnung: geschweifte Klammern um Skalar-Initialisierung
    tty.c:90: Warnung: (near initialization for `ttyperm')
    tty.c:90: Warnung: Initialisierung erzeugt Ganzzahl von Zeiger ohne Typkonvertierung
    tty.c:90: Warnung: Elementüberschreitung in Skalar-Initialisierung
    tty.c:90: Warnung: (nahe der Initialisierung für »ttyperm«)
    tty.c:90: Warnung: Elementüberschreitung in Skalar-Initialisierung
    tty.c:90: Warnung: (nahe der Initialisierung für »ttyperm«)
    tty.c:90: Warnung: Elementüberschreitung in Skalar-Initialisierung
    tty.c:90: Warnung: (nahe der Initialisierung für »ttyperm«)
    tty.c:91: Warnung: Elementüberschreitung in Skalar-Initialisierung
    tty.c:91: Warnung: (nahe der Initialisierung für »ttyperm«)
    tty.c:92: Warnung: data definition has no type or storage class
    tty.c:161: error: Syntaxfehler before "ttymodes"
    tty.c:163: Warnung: geschweifte Klammern um Skalar-Initialisierung
    tty.c:163: Warnung: (near initialization for `ttymodes[0]')
    tty.c:163: Warnung: Initialisierung erzeugt Ganzzahl von Zeiger ohne Typkonvertierung
    tty.c:163: Warnung: Elementüberschreitung in Skalar-Initialisierung
    tty.c:163: Warnung: (nahe der Initialisierung für »ttymodes[0]«)
    tty.c:163: Warnung: Elementüberschreitung in Skalar-Initialisierung
    tty.c:163: Warnung: (nahe der Initialisierung für »ttymodes[0]«)
    tty.c:166: Warnung: geschweifte Klammern um Skalar-Initialisierung
    tty.c:166: Warnung: (near initialization for `ttymodes[1]')
    tty.c:166: Warnung: Initialisierung erzeugt Ganzzahl von Zeiger ohne Typkonvertierung
    tty.c:166: Warnung: Elementüberschreitung in Skalar-Initialisierung
    tty.c:166: Warnung: (nahe der Initialisierung für »ttymodes[1]«)
    tty.c:166: Warnung: Elementüberschreitung in Skalar-Initialisierung
    tty.c:166: Warnung: (nahe der Initialisierung für »ttymodes[1]«)
    tty.c:169: Warnung: geschweifte Klammern um Skalar-Initialisierung
    tty.c:169: Warnung: (near initialization for `ttymodes[2]')
    tty.c:169: Warnung: Initialisierung erzeugt Ganzzahl von Zeiger ohne Typkonvertierung
    tty.c:169: Warnung: Elementüberschreitung in Skalar-Initialisierung
    tty.c:169: Warnung: (nahe der Initialisierung für »ttymodes[2]«)
    tty.c:169: Warnung: Elementüberschreitung in Skalar-Initialisierung
    tty.c:169: Warnung: (nahe der Initialisierung für »ttymodes[2]«)
    tty.c:172: Warnung: geschweifte Klammern um Skalar-Initialisierung
    tty.c:172: Warnung: (near initialization for `ttymodes[3]')
    tty.c:172: Warnung: Initialisierung erzeugt Ganzzahl von Zeiger ohne Typkonvertierung
    tty.c:172: Warnung: Elementüberschreitung in Skalar-Initialisierung
    tty.c:172: Warnung: (nahe der Initialisierung für »ttymodes[3]«)
    tty.c:172: Warnung: Elementüberschreitung in Skalar-Initialisierung
    tty.c:172: Warnung: (nahe der Initialisierung für »ttymodes[3]«)
    tty.c:175: Warnung: geschweifte Klammern um Skalar-Initialisierung
    tty.c:175: Warnung: (near initialization for `ttymodes[4]')
    tty.c:175: Warnung: Initialisierung erzeugt Ganzzahl von Zeiger ohne Typkonvertierung
    tty.c:175: Warnung: Elementüberschreitung in Skalar-Initialisierung
    tty.c:175: Warnung: (nahe der Initialisierung für »ttymodes[4]«)
    tty.c:175: Warnung: Elementüberschreitung in Skalar-Initialisierung
    tty.c:175: Warnung: (nahe der Initialisierung für »ttymodes[4]«)
    tty.c:178: Warnung: geschweifte Klammern um Skalar-Initialisierung
    tty.c:178: Warnung: (near initialization for `ttymodes[5]')
    tty.c:178: Warnung: Initialisierung erzeugt Ganzzahl von Zeiger ohne Typkonvertierung
    tty.c:178: Warnung: Elementüberschreitung in Skalar-Initialisierung
    tty.c:178: Warnung: (nahe der Initialisierung für »ttymodes[5]«)
    tty.c:178: Warnung: Elementüberschreitung in Skalar-Initialisierung
    tty.c:178: Warnung: (nahe der Initialisierung für »ttymodes[5]«)
    tty.c:181: Warnung: geschweifte Klammern um Skalar-Initialisierung
    tty.c:181: Warnung: (near initialization for `ttymodes[6]')
    tty.c:181: Warnung: Initialisierung erzeugt Ganzzahl von Zeiger ohne Typkonvertierung
    tty.c:181: Warnung: Elementüberschreitung in Skalar-Initialisierung
    tty.c:181: Warnung: (nahe der Initialisierung für »ttymodes[6]«)
    tty.c:181: Warnung: Elementüberschreitung in Skalar-Initialisierung
    tty.c:181: Warnung: (nahe der Initialisierung für »ttymodes[6]«)
    tty.c:184: Warnung: geschweifte Klammern um Skalar-Initialisierung
    tty.c:184: Warnung: (near initialization for `ttymodes[7]')
    tty.c:184: Warnung: Initialisierung erzeugt Ganzzahl von Zeiger ohne Typkonvertierung
    tty.c:184: Warnung: Elementüberschreitung in Skalar-Initialisierung
    tty.c:184: Warnung: (nahe der Initialisierung für »ttymodes[7]«)
    tty.c:184: Warnung: Elementüberschreitung in Skalar-Initialisierung
    tty.c:184: Warnung: (nahe der Initialisierung für »ttymodes[7]«)
    tty.c:187: Warnung: geschweifte Klammern um Skalar-Initialisierung
    tty.c:187: Warnung: (near initialization for `ttymodes[8]')
    tty.c:187: Warnung: Initialisierung erzeugt Ganzzahl von Zeiger ohne Typkonvertierung
    tty.c:187: Warnung: Elementüberschreitung in Skalar-Initialisierung
    tty.c:187: Warnung: (nahe der Initialisierung für »ttymodes[8]«)
    tty.c:187: Warnung: Elementüberschreitung in Skalar-Initialisierung
    tty.c:187: Warnung: (nahe der Initialisierung für »ttymodes[8]«)
    tty.c:190: Warnung: geschweifte Klammern um Skalar-Initialisierung
    tty.c:190: Warnung: (near initialization for `ttymodes[9]')
    tty.c:190: Warnung: Initialisierung erzeugt Ganzzahl von Zeiger ohne Typkonvertierung
    tty.c:190: Warnung: Elementüberschreitung in Skalar-Initialisierung
    tty.c:190: Warnung: (nahe der Initialisierung für »ttymodes[9]«)
    tty.c:190: Warnung: Elementüberschreitung in Skalar-Initialisierung
    tty.c:190: Warnung: (nahe der Initialisierung für »ttymodes[9]«)
    tty.c:193: Warnung: geschweifte Klammern um Skalar-Initialisierung
    tty.c:193: Warnung: (near initialization for `ttymodes[10]')
    tty.c:193: Warnung: Initialisierung erzeugt Ganzzahl von Zeiger ohne Typkonvertierung
    tty.c:193: Warnung: Elementüberschreitung in Skalar-Initialisierung
    tty.c:193: Warnung: (nahe der Initialisierung für »ttymodes[10]«)
    tty.c:193: Warnung: Elementüberschreitung in Skalar-Initialisierung
    tty.c:193: Warnung: (nahe der Initialisierung für »ttymodes[10]«)
    tty.c:196: Warnung: geschweifte Klammern um Skalar-Initialisierung
    tty.c:196: Warnung: (near initialization for `ttymodes[11]')
    tty.c:196: Warnung: Initialisierung erzeugt Ganzzahl von Zeiger ohne Typkonvertierung
    tty.c:196: Warnung: Elementüberschreitung in Skalar-Initialisierung
    tty.c:196: Warnung: (nahe der Initialisierung für »ttymodes[11]«)
    tty.c:196: Warnung: Elementüberschreitung in Skalar-Initialisierung
    tty.c:196: Warnung: (nahe der Initialisierung für »ttymodes[11]«)
    tty.c:199: Warnung: geschweifte Klammern um Skalar-Initialisierung
    tty.c:199: Warnung: (near initialization for `ttymodes[12]')
    tty.c:199: Warnung: Initialisierung erzeugt Ganzzahl von Zeiger ohne Typkonvertierung
    tty.c:199: Warnung: Elementüberschreitung in Skalar-Initialisierung
    tty.c:199: Warnung: (nahe der Initialisierung für »ttymodes[12]«)
    tty.c:199: Warnung: Elementüberschreitung in Skalar-Initialisierung
    tty.c:199: Warnung: (nahe der Initialisierung für »ttymodes[12]«)
    tty.c:202: Warnung: geschweifte Klammern um Skalar-Initialisierung
    tty.c:202: Warnung: (near initialization for `ttymodes[13]')
    tty.c:202: Warnung: Initialisierung erzeugt Ganzzahl von Zeiger ohne Typkonvertierung
    tty.c:202: Warnung: Elementüberschreitung in Skalar-Initialisierung
    tty.c:202: Warnung: (nahe der Initialisierung für »ttymodes[13]«)
    tty.c:202: Warnung: Elementüberschreitung in Skalar-Initialisierung
    tty.c:202: Warnung: (nahe der Initialisierung für »ttymodes[13]«)
    tty.c:206: Warnung: geschweifte Klammern um Skalar-Initialisierung
    tty.c:206: Warnung: (near initialization for `ttymodes[14]')
    tty.c:206: Warnung: Initialisierung erzeugt Ganzzahl von Zeiger ohne Typkonvertierung
    tty.c:206: Warnung: Elementüberschreitung in Skalar-Initialisierung
    tty.c:206: Warnung: (nahe der Initialisierung für »ttymodes[14]«)
    tty.c:206: Warnung: Elementüberschreitung in Skalar-Initialisierung
    tty.c:206: Warnung: (nahe der Initialisierung für »ttymodes[14]«)
    tty.c:209: Warnung: geschweifte Klammern um Skalar-Initialisierung
    tty.c:209: Warnung: (near initialization for `ttymodes[15]')
    tty.c:209: Warnung: Initialisierung erzeugt Ganzzahl von Zeiger ohne Typkonvertierung
    tty.c:209: Warnung: Elementüberschreitung in Skalar-Initialisierung
    tty.c:209: Warnung: (nahe der Initialisierung für »ttymodes[15]«)
    tty.c:209: Warnung: Elementüberschreitung in Skalar-Initialisierung
    tty.c:209: Warnung: (nahe der Initialisierung für »ttymodes[15]«)
    tty.c:212: Warnung: geschweifte Klammern um Skalar-Initialisierung
    tty.c:212: Warnung: (near initialization for `ttymodes[16]')
    tty.c:212: Warnung: Initialisierung erzeugt Ganzzahl von Zeiger ohne Typkonvertierung
    tty.c:212: Warnung: Elementüberschreitung in Skalar-Initialisierung
    tty.c:212: Warnung: (nahe der Initialisierung für »ttymodes[16]«)
    tty.c:212: Warnung: Elementüberschreitung in Skalar-Initialisierung
    tty.c:212: Warnung: (nahe der Initialisierung für »ttymodes[16]«)
    tty.c:215: Warnung: geschweifte Klammern um Skalar-Initialisierung
    tty.c:215: Warnung: (near initialization for `ttymodes[17]')
    tty.c:215: Warnung: Initialisierung erzeugt Ganzzahl von Zeiger ohne Typkonvertierung
    tty.c:215: Warnung: Elementüberschreitung in Skalar-Initialisierung
    tty.c:215: Warnung: (nahe der Initialisierung für »ttymodes[17]«)
    tty.c:215: Warnung: Elementüberschreitung in Skalar-Initialisierung
    tty.c:215: Warnung: (nahe der Initialisierung für »ttymodes[17]«)
    tty.c:218: Warnung: geschweifte Klammern um Skalar-Initialisierung
    tty.c:218: Warnung: (near initialization for `ttymodes[18]')
    tty.c:218: Warnung: Initialisierung erzeugt Ganzzahl von Zeiger ohne Typkonvertierung
    tty.c:218: Warnung: Elementüberschreitung in Skalar-Initialisierung
    tty.c:218: Warnung: (nahe der Initialisierung für »ttymodes[18]«)
    tty.c:218: Warnung: Elementüberschreitung in Skalar-Initialisierung
    tty.c:218: Warnung: (nahe der Initialisierung für »ttymodes[18]«)
    tty.c:224: Warnung: geschweifte Klammern um Skalar-Initialisierung
    tty.c:224: Warnung: (near initialization for `ttymodes[19]')
    tty.c:224: Warnung: Initialisierung erzeugt Ganzzahl von Zeiger ohne Typkonvertierung
    tty.c:224: Warnung: Elementüberschreitung in Skalar-Initialisierung
    tty.c:224: Warnung: (nahe der Initialisierung für »ttymodes[19]«)
    tty.c:224: Warnung: Elementüberschreitung in Skalar-Initialisierung
    tty.c:224: Warnung: (nahe der Initialisierung für »ttymodes[19]«)
    tty.c:227: Warnung: geschweifte Klammern um Skalar-Initialisierung
    tty.c:227: Warnung: (near initialization for `ttymodes[20]')
    tty.c:227: Warnung: Initialisierung erzeugt Ganzzahl von Zeiger ohne Typkonvertierung
    tty.c:227: Warnung: Elementüberschreitung in Skalar-Initialisierung
    tty.c:227: Warnung: (nahe der Initialisierung für »ttymodes[20]«)
    tty.c:227: Warnung: Elementüberschreitung in Skalar-Initialisierung
    tty.c:227: Warnung: (nahe der Initialisierung für »ttymodes[20]«)
    tty.c:230: Warnung: geschweifte Klammern um Skalar-Initialisierung
    tty.c:230: Warnung: (near initialization for `ttymodes[21]')
    tty.c:230: Warnung: Initialisierung erzeugt Ganzzahl von Zeiger ohne Typkonvertierung
    tty.c:230: Warnung: Elementüberschreitung in Skalar-Initialisierung
    tty.c:230: Warnung: (nahe der Initialisierung für »ttymodes[21]«)
    tty.c:230: Warnung: Elementüberschreitung in Skalar-Initialisierung
    tty.c:230: Warnung: (nahe der Initialisierung für »ttymodes[21]«)
    tty.c:248: Warnung: geschweifte Klammern um Skalar-Initialisierung
    tty.c:248: Warnung: (near initialization for `ttymodes[22]')
    tty.c:248: Warnung: Initialisierung erzeugt Ganzzahl von Zeiger ohne Typkonvertierung
    tty.c:248: Warnung: Elementüberschreitung in Skalar-Initialisierung
    tty.c:248: Warnung: (nahe der Initialisierung für »ttymodes[22]«)
    tty.c:248: Warnung: Elementüberschreitung in Skalar-Initialisierung
    tty.c:248: Warnung: (nahe der Initialisierung für »ttymodes[22]«)
    tty.c:267: Warnung: geschweifte Klammern um Skalar-Initialisierung
    tty.c:267: Warnung: (near initialization for `ttymodes[23]')
    tty.c:267: Warnung: Initialisierung erzeugt Ganzzahl von Zeiger ohne Typkonvertierung
    tty.c:267: Warnung: Elementüberschreitung in Skalar-Initialisierung
    tty.c:267: Warnung: (nahe der Initialisierung für »ttymodes[23]«)
    tty.c:267: Warnung: Elementüberschreitung in Skalar-Initialisierung
    tty.c:267: Warnung: (nahe der Initialisierung für »ttymodes[23]«)
    tty.c:270: Warnung: geschweifte Klammern um Skalar-Initialisierung
    tty.c:270: Warnung: (near initialization for `ttymodes[24]')
    tty.c:270: Warnung: Initialisierung erzeugt Ganzzahl von Zeiger ohne Typkonvertierung
    tty.c:270: Warnung: Elementüberschreitung in Skalar-Initialisierung
    tty.c:270: Warnung: (nahe der Initialisierung für »ttymodes[24]«)
    tty.c:270: Warnung: Elementüberschreitung in Skalar-Initialisierung
    tty.c:270: Warnung: (nahe der Initialisierung für »ttymodes[24]«)
    tty.c:273: Warnung: geschweifte Klammern um Skalar-Initialisierung
    tty.c:273: Warnung: (near initialization for `ttymodes[25]')
    tty.c:273: Warnung: Initialisierung erzeugt Ganzzahl von Zeiger ohne Typkonvertierung
    tty.c:273: Warnung: Elementüberschreitung in Skalar-Initialisierung
    tty.c:273: Warnung: (nahe der Initialisierung für »ttymodes[25]«)
    tty.c:273: Warnung: Elementüberschreitung in Skalar-Initialisierung
    tty.c:273: Warnung: (nahe der Initialisierung für »ttymodes[25]«)
    tty.c:276: Warnung: geschweifte Klammern um Skalar-Initialisierung
    tty.c:276: Warnung: (near initialization for `ttymodes[26]')
    tty.c:276: Warnung: Initialisierung erzeugt Ganzzahl von Zeiger ohne Typkonvertierung
    tty.c:276: Warnung: Elementüberschreitung in Skalar-Initialisierung
    tty.c:276: Warnung: (nahe der Initialisierung für »ttymodes[26]«)
    tty.c:276: Warnung: Elementüberschreitung in Skalar-Initialisierung
    tty.c:276: Warnung: (nahe der Initialisierung für »ttymodes[26]«)
    tty.c:279: Warnung: geschweifte Klammern um Skalar-Initialisierung
    tty.c:279: Warnung: (near initialization for `ttymodes[27]')
    tty.c:279: Warnung: Initialisierung erzeugt Ganzzahl von Zeiger ohne Typkonvertierung
    tty.c:279: Warnung: Elementüberschreitung in Skalar-Initialisierung
    tty.c:279: Warnung: (nahe der Initialisierung für »ttymodes[27]«)
    tty.c:279: Warnung: Elementüberschreitung in Skalar-Initialisierung
    tty.c:279: Warnung: (nahe der Initialisierung für »ttymodes[27]«)
    tty.c:282: Warnung: geschweifte Klammern um Skalar-Initialisierung
    tty.c:282: Warnung: (near initialization for `ttymodes[28]')
    tty.c:282: Warnung: Initialisierung erzeugt Ganzzahl von Zeiger ohne Typkonvertierung
    tty.c:282: Warnung: Elementüberschreitung in Skalar-Initialisierung
    tty.c:282: Warnung: (nahe der Initialisierung für »ttymodes[28]«)
    tty.c:282: Warnung: Elementüberschreitung in Skalar-Initialisierung
    tty.c:282: Warnung: (nahe der Initialisierung für »ttymodes[28]«)
    tty.c:314: Warnung: geschweifte Klammern um Skalar-Initialisierung
    tty.c:314: Warnung: (near initialization for `ttymodes[29]')
    tty.c:314: Warnung: Initialisierung erzeugt Ganzzahl von Zeiger ohne Typkonvertierung
    tty.c:314: Warnung: Elementüberschreitung in Skalar-Initialisierung
    tty.c:314: Warnung: (nahe der Initialisierung für »ttymodes[29]«)
    tty.c:314: Warnung: Elementüberschreitung in Skalar-Initialisierung
    tty.c:314: Warnung: (nahe der Initialisierung für »ttymodes[29]«)
    tty.c:317: Warnung: geschweifte Klammern um Skalar-Initialisierung
    tty.c:317: Warnung: (near initialization for `ttymodes[30]')
    tty.c:317: Warnung: Initialisierung erzeugt Ganzzahl von Zeiger ohne Typkonvertierung
    tty.c:317: Warnung: Elementüberschreitung in Skalar-Initialisierung
    tty.c:317: Warnung: (nahe der Initialisierung für »ttymodes[30]«)
    tty.c:317: Warnung: Elementüberschreitung in Skalar-Initialisierung
    tty.c:317: Warnung: (nahe der Initialisierung für »ttymodes[30]«)
    tty.c:323: Warnung: geschweifte Klammern um Skalar-Initialisierung
    tty.c:323: Warnung: (near initialization for `ttymodes[31]')
    tty.c:323: Warnung: Initialisierung erzeugt Ganzzahl von Zeiger ohne Typkonvertierung
    tty.c:323: Warnung: Elementüberschreitung in Skalar-Initialisierung
    tty.c:323: Warnung: (nahe der Initialisierung für »ttymodes[31]«)
    tty.c:323: Warnung: Elementüberschreitung in Skalar-Initialisierung
    tty.c:323: Warnung: (nahe der Initialisierung für »ttymodes[31]«)
    tty.c:326: Warnung: geschweifte Klammern um Skalar-Initialisierung
    tty.c:326: Warnung: (near initialization for `ttymodes[32]')
    tty.c:326: Warnung: Initialisierung erzeugt Ganzzahl von Zeiger ohne Typkonvertierung
    tty.c:326: Warnung: Elementüberschreitung in Skalar-Initialisierung
    tty.c:326: Warnung: (nahe der Initialisierung für »ttymodes[32]«)
    tty.c:326: Warnung: Elementüberschreitung in Skalar-Initialisierung
    tty.c:326: Warnung: (nahe der Initialisierung für »ttymodes[32]«)
    tty.c:329: Warnung: geschweifte Klammern um Skalar-Initialisierung
    tty.c:329: Warnung: (near initialization for `ttymodes[33]')
    tty.c:329: Warnung: Initialisierung erzeugt Ganzzahl von Zeiger ohne Typkonvertierung
    tty.c:329: Warnung: Elementüberschreitung in Skalar-Initialisierung
    tty.c:329: Warnung: (nahe der Initialisierung für »ttymodes[33]«)
    tty.c:329: Warnung: Elementüberschreitung in Skalar-Initialisierung
    tty.c:329: Warnung: (nahe der Initialisierung für »ttymodes[33]«)
    tty.c:332: Warnung: geschweifte Klammern um Skalar-Initialisierung
    tty.c:332: Warnung: (near initialization for `ttymodes[34]')
    tty.c:332: Warnung: Initialisierung erzeugt Ganzzahl von Zeiger ohne Typkonvertierung
    tty.c:332: Warnung: Elementüberschreitung in Skalar-Initialisierung
    tty.c:332: Warnung: (nahe der Initialisierung für »ttymodes[34]«)
    tty.c:332: Warnung: Elementüberschreitung in Skalar-Initialisierung
    tty.c:332: Warnung: (nahe der Initialisierung für »ttymodes[34]«)
    tty.c:335: Warnung: geschweifte Klammern um Skalar-Initialisierung
    tty.c:335: Warnung: (near initialization for `ttymodes[35]')
    tty.c:335: Warnung: Initialisierung erzeugt Ganzzahl von Zeiger ohne Typkonvertierung
    tty.c:335: Warnung: Elementüberschreitung in Skalar-Initialisierung
    tty.c:335: Warnung: (nahe der Initialisierung für »ttymodes[35]«)
    tty.c:335: Warnung: Elementüberschreitung in Skalar-Initialisierung
    tty.c:335: Warnung: (nahe der Initialisierung für »ttymodes[35]«)
    tty.c:338: Warnung: geschweifte Klammern um Skalar-Initialisierung
    tty.c:338: Warnung: (near initialization for `ttymodes[36]')
    tty.c:338: Warnung: Initialisierung erzeugt Ganzzahl von Zeiger ohne Typkonvertierung
    tty.c:338: Warnung: Elementüberschreitung in Skalar-Initialisierung
    tty.c:338: Warnung: (nahe der Initialisierung für »ttymodes[36]«)
    tty.c:338: Warnung: Elementüberschreitung in Skalar-Initialisierung
    tty.c:338: Warnung: (nahe der Initialisierung für »ttymodes[36]«)
    tty.c:341: Warnung: geschweifte Klammern um Skalar-Initialisierung
    tty.c:341: Warnung: (near initialization for `ttymodes[37]')
    tty.c:341: Warnung: Initialisierung erzeugt Ganzzahl von Zeiger ohne Typkonvertierung
    tty.c:341: Warnung: Elementüberschreitung in Skalar-Initialisierung
    tty.c:341: Warnung: (nahe der Initialisierung für »ttymodes[37]«)
    tty.c:341: Warnung: Elementüberschreitung in Skalar-Initialisierung
    tty.c:341: Warnung: (nahe der Initialisierung für »ttymodes[37]«)
    tty.c:353: Warnung: geschweifte Klammern um Skalar-Initialisierung
    tty.c:353: Warnung: (near initialization for `ttymodes[38]')
    tty.c:353: Warnung: Initialisierung erzeugt Ganzzahl von Zeiger ohne Typkonvertierung
    tty.c:353: Warnung: Elementüberschreitung in Skalar-Initialisierung
    tty.c:353: Warnung: (nahe der Initialisierung für »ttymodes[38]«)
    tty.c:353: Warnung: Elementüberschreitung in Skalar-Initialisierung
    tty.c:353: Warnung: (nahe der Initialisierung für »ttymodes[38]«)
    tty.c:359: Warnung: geschweifte Klammern um Skalar-Initialisierung
    tty.c:359: Warnung: (near initialization for `ttymodes[39]')
    tty.c:359: Warnung: Initialisierung erzeugt Ganzzahl von Zeiger ohne Typkonvertierung
    tty.c:359: Warnung: Elementüberschreitung in Skalar-Initialisierung
    tty.c:359: Warnung: (nahe der Initialisierung für »ttymodes[39]«)
    tty.c:359: Warnung: Elementüberschreitung in Skalar-Initialisierung
    tty.c:359: Warnung: (nahe der Initialisierung für »ttymodes[39]«)
    tty.c:368: Warnung: geschweifte Klammern um Skalar-Initialisierung
    tty.c:368: Warnung: (near initialization for `ttymodes[40]')
    tty.c:368: Warnung: Initialisierung erzeugt Ganzzahl von Zeiger ohne Typkonvertierung
    tty.c:368: Warnung: Elementüberschreitung in Skalar-Initialisierung
    tty.c:368: Warnung: (nahe der Initialisierung für »ttymodes[40]«)
    tty.c:368: Warnung: Elementüberschreitung in Skalar-Initialisierung
    tty.c:368: Warnung: (nahe der Initialisierung für »ttymodes[40]«)
    tty.c:372: Warnung: geschweifte Klammern um Skalar-Initialisierung
    tty.c:372: Warnung: (near initialization for `ttymodes[41]')
    tty.c:372: Warnung: Initialisierung erzeugt Ganzzahl von Zeiger ohne Typkonvertierung
    tty.c:372: Warnung: Elementüberschreitung in Skalar-Initialisierung
    tty.c:372: Warnung: (nahe der Initialisierung für »ttymodes[41]«)
    tty.c:372: Warnung: Elementüberschreitung in Skalar-Initialisierung
    tty.c:372: Warnung: (nahe der Initialisierung für »ttymodes[41]«)
    tty.c:375: Warnung: geschweifte Klammern um Skalar-Initialisierung
    tty.c:375: Warnung: (near initialization for `ttymodes[42]')
    tty.c:375: Warnung: Initialisierung erzeugt Ganzzahl von Zeiger ohne Typkonvertierung
    tty.c:375: Warnung: Elementüberschreitung in Skalar-Initialisierung
    tty.c:375: Warnung: (nahe der Initialisierung für »ttymodes[42]«)
    tty.c:375: Warnung: Elementüberschreitung in Skalar-Initialisierung
    tty.c:375: Warnung: (nahe der Initialisierung für »ttymodes[42]«)
    tty.c:378: Warnung: geschweifte Klammern um Skalar-Initialisierung
    tty.c:378: Warnung: (near initialization for `ttymodes[43]')
    tty.c:378: Warnung: Initialisierung erzeugt Ganzzahl von Zeiger ohne Typkonvertierung
    tty.c:378: Warnung: Elementüberschreitung in Skalar-Initialisierung
    tty.c:378: Warnung: (nahe der Initialisierung für »ttymodes[43]«)
    tty.c:378: Warnung: Elementüberschreitung in Skalar-Initialisierung
    tty.c:378: Warnung: (nahe der Initialisierung für »ttymodes[43]«)
    tty.c:381: Warnung: geschweifte Klammern um Skalar-Initialisierung
    tty.c:381: Warnung: (near initialization for `ttymodes[44]')
    tty.c:381: Warnung: Initialisierung erzeugt Ganzzahl von Zeiger ohne Typkonvertierung
    tty.c:381: Warnung: Elementüberschreitung in Skalar-Initialisierung
    tty.c:381: Warnung: (nahe der Initialisierung für »ttymodes[44]«)
    tty.c:381: Warnung: Elementüberschreitung in Skalar-Initialisierung
    tty.c:381: Warnung: (nahe der Initialisierung für »ttymodes[44]«)
    tty.c:384: Warnung: geschweifte Klammern um Skalar-Initialisierung
    tty.c:384: Warnung: (near initialization for `ttymodes[45]')
    tty.c:384: Warnung: Initialisierung erzeugt Ganzzahl von Zeiger ohne Typkonvertierung
    tty.c:384: Warnung: Elementüberschreitung in Skalar-Initialisierung
    tty.c:384: Warnung: (nahe der Initialisierung für »ttymodes[45]«)
    tty.c:384: Warnung: Elementüberschreitung in Skalar-Initialisierung
    tty.c:384: Warnung: (nahe der Initialisierung für »ttymodes[45]«)
    tty.c:387: Warnung: geschweifte Klammern um Skalar-Initialisierung
    tty.c:387: Warnung: (near initialization for `ttymodes[46]')
    tty.c:387: Warnung: Initialisierung erzeugt Ganzzahl von Zeiger ohne Typkonvertierung
    tty.c:387: Warnung: Elementüberschreitung in Skalar-Initialisierung
    tty.c:387: Warnung: (nahe der Initialisierung für »ttymodes[46]«)
    tty.c:387: Warnung: Elementüberschreitung in Skalar-Initialisierung
    tty.c:387: Warnung: (nahe der Initialisierung für »ttymodes[46]«)
    tty.c:390: Warnung: geschweifte Klammern um Skalar-Initialisierung
    tty.c:390: Warnung: (near initialization for `ttymodes[47]')
    tty.c:390: Warnung: Initialisierung erzeugt Ganzzahl von Zeiger ohne Typkonvertierung
    tty.c:390: Warnung: Elementüberschreitung in Skalar-Initialisierung
    tty.c:390: Warnung: (nahe der Initialisierung für »ttymodes[47]«)
    tty.c:390: Warnung: Elementüberschreitung in Skalar-Initialisierung
    tty.c:390: Warnung: (nahe der Initialisierung für »ttymodes[47]«)
    tty.c:402: Warnung: geschweifte Klammern um Skalar-Initialisierung
    tty.c:402: Warnung: (near initialization for `ttymodes[48]')
    tty.c:402: Warnung: Initialisierung erzeugt Ganzzahl von Zeiger ohne Typkonvertierung
    tty.c:402: Warnung: Elementüberschreitung in Skalar-Initialisierung
    tty.c:402: Warnung: (nahe der Initialisierung für »ttymodes[48]«)
    tty.c:402: Warnung: Elementüberschreitung in Skalar-Initialisierung
    tty.c:402: Warnung: (nahe der Initialisierung für »ttymodes[48]«)
    tty.c:405: Warnung: geschweifte Klammern um Skalar-Initialisierung
    tty.c:405: Warnung: (near initialization for `ttymodes[49]')
    tty.c:405: Warnung: Initialisierung erzeugt Ganzzahl von Zeiger ohne Typkonvertierung
    tty.c:405: Warnung: Elementüberschreitung in Skalar-Initialisierung
    tty.c:405: Warnung: (nahe der Initialisierung für »ttymodes[49]«)
    tty.c:405: Warnung: Elementüberschreitung in Skalar-Initialisierung
    tty.c:405: Warnung: (nahe der Initialisierung für »ttymodes[49]«)
    tty.c:408: Warnung: geschweifte Klammern um Skalar-Initialisierung
    tty.c:408: Warnung: (near initialization for `ttymodes[50]')
    tty.c:408: Warnung: Initialisierung erzeugt Ganzzahl von Zeiger ohne Typkonvertierung
    tty.c:408: Warnung: Elementüberschreitung in Skalar-Initialisierung
    tty.c:408: Warnung: (nahe der Initialisierung für »ttymodes[50]«)
    tty.c:408: Warnung: Elementüberschreitung in Skalar-Initialisierung
    tty.c:408: Warnung: (nahe der Initialisierung für »ttymodes[50]«)
    tty.c:411: Warnung: geschweifte Klammern um Skalar-Initialisierung
    tty.c:411: Warnung: (near initialization for `ttymodes[51]')
    tty.c:411: Warnung: Initialisierung erzeugt Ganzzahl von Zeiger ohne Typkonvertierung
    tty.c:411: Warnung: Elementüberschreitung in Skalar-Initialisierung
    tty.c:411: Warnung: (nahe der Initialisierung für »ttymodes[51]«)
    tty.c:411: Warnung: Elementüberschreitung in Skalar-Initialisierung
    tty.c:411: Warnung: (nahe der Initialisierung für »ttymodes[51]«)
    tty.c:417: Warnung: geschweifte Klammern um Skalar-Initialisierung
    tty.c:417: Warnung: (near initialization for `ttymodes[52]')
    tty.c:417: Warnung: Initialisierung erzeugt Ganzzahl von Zeiger ohne Typkonvertierung
    tty.c:417: Warnung: Elementüberschreitung in Skalar-Initialisierung
    tty.c:417: Warnung: (nahe der Initialisierung für »ttymodes[52]«)
    tty.c:417: Warnung: Elementüberschreitung in Skalar-Initialisierung
    tty.c:417: Warnung: (nahe der Initialisierung für »ttymodes[52]«)
    tty.c:420: Warnung: geschweifte Klammern um Skalar-Initialisierung
    tty.c:420: Warnung: (near initialization for `ttymodes[53]')
    tty.c:420: Warnung: Initialisierung erzeugt Ganzzahl von Zeiger ohne Typkonvertierung
    tty.c:420: Warnung: Elementüberschreitung in Skalar-Initialisierung
    tty.c:420: Warnung: (nahe der Initialisierung für »ttymodes[53]«)
    tty.c:420: Warnung: Elementüberschreitung in Skalar-Initialisierung
    tty.c:420: Warnung: (nahe der Initialisierung für »ttymodes[53]«)
    tty.c:423: Warnung: geschweifte Klammern um Skalar-Initialisierung
    tty.c:423: Warnung: (near initialization for `ttymodes[54]')
    tty.c:423: Warnung: Initialisierung erzeugt Ganzzahl von Zeiger ohne Typkonvertierung
    tty.c:423: Warnung: Elementüberschreitung in Skalar-Initialisierung
    tty.c:423: Warnung: (nahe der Initialisierung für »ttymodes[54]«)
    tty.c:423: Warnung: Elementüberschreitung in Skalar-Initialisierung
    tty.c:423: Warnung: (nahe der Initialisierung für »ttymodes[54]«)
    tty.c:441: Warnung: geschweifte Klammern um Skalar-Initialisierung
    tty.c:441: Warnung: (near initialization for `ttymodes[55]')
    tty.c:441: Warnung: Initialisierung erzeugt Ganzzahl von Zeiger ohne Typkonvertierung
    tty.c:441: Warnung: Elementüberschreitung in Skalar-Initialisierung
    tty.c:441: Warnung: (nahe der Initialisierung für »ttymodes[55]«)
    tty.c:441: Warnung: Elementüberschreitung in Skalar-Initialisierung
    tty.c:441: Warnung: (nahe der Initialisierung für »ttymodes[55]«)
    tty.c:444: Warnung: geschweifte Klammern um Skalar-Initialisierung
    tty.c:444: Warnung: (near initialization for `ttymodes[56]')
    tty.c:444: Warnung: Initialisierung erzeugt Ganzzahl von Zeiger ohne Typkonvertierung
    tty.c:444: Warnung: Elementüberschreitung in Skalar-Initialisierung
    tty.c:444: Warnung: (nahe der Initialisierung für »ttymodes[56]«)
    tty.c:444: Warnung: Elementüberschreitung in Skalar-Initialisierung
    tty.c:444: Warnung: (nahe der Initialisierung für »ttymodes[56]«)
    tty.c:446: Warnung: geschweifte Klammern um Skalar-Initialisierung
    tty.c:446: Warnung: (near initialization for `ttymodes[57]')
    tty.c:446: Warnung: Initialisierung erzeugt Ganzzahl von Zeiger ohne Typkonvertierung
    tty.c:446: Warnung: Elementüberschreitung in Skalar-Initialisierung
    tty.c:446: Warnung: (nahe der Initialisierung für »ttymodes[57]«)
    tty.c:446: Warnung: Elementüberschreitung in Skalar-Initialisierung
    tty.c:446: Warnung: (nahe der Initialisierung für »ttymodes[57]«)
    tty.c:447: Warnung: data definition has no type or storage class
    tty.c: In Funktion »tty_setup«:
    tty.c:474: error: dereferencing pointer to incomplete type
    tty.c:477: error: dereferencing pointer to incomplete type
    tty.c:477: error: dereferencing pointer to incomplete type
    tty.c:484: error: dereferencing pointer to incomplete type
    tty.c:484: error: dereferencing pointer to incomplete type
    tty.c:484: error: dereferencing pointer to incomplete type
    tty.c:486: error: dereferencing pointer to incomplete type
    tty.c:486: error: dereferencing pointer to incomplete type
    tty.c:487: error: dereferencing pointer to incomplete type
    tty.c:487: error: dereferencing pointer to incomplete type
    tty.c:488: error: dereferencing pointer to incomplete type
    tty.c:488: error: dereferencing pointer to incomplete type
    tty.c:490: error: dereferencing pointer to incomplete type
    tty.c:490: error: dereferencing pointer to incomplete type
    tty.c:491: error: dereferencing pointer to incomplete type
    tty.c:491: error: dereferencing pointer to incomplete type
    tty.c:493: error: dereferencing pointer to incomplete type
    tty.c:493: error: dereferencing pointer to incomplete type
    tty.c:494: error: dereferencing pointer to incomplete type
    tty.c:494: error: dereferencing pointer to incomplete type
    tty.c:496: error: dereferencing pointer to incomplete type
    tty.c:496: error: dereferencing pointer to incomplete type
    tty.c:497: error: dereferencing pointer to incomplete type
    tty.c:497: error: dereferencing pointer to incomplete type
    tty.c:499: error: dereferencing pointer to incomplete type
    tty.c:499: error: dereferencing pointer to incomplete type
    tty.c:500: error: dereferencing pointer to incomplete type
    tty.c:500: error: dereferencing pointer to incomplete type
    tty.c:507: error: dereferencing pointer to incomplete type
    tty.c:508: error: dereferencing pointer to incomplete type
    tty.c:508: error: dereferencing pointer to incomplete type
    tty.c:513: error: dereferencing pointer to incomplete type
    tty.c:514: error: dereferencing pointer to incomplete type
    tty.c:515: error: dereferencing pointer to incomplete type
    tty.c:516: error: dereferencing pointer to incomplete type
    tty.c:517: error: dereferencing pointer to incomplete type
    tty.c:518: error: dereferencing pointer to incomplete type
    tty.c:520: error: dereferencing pointer to incomplete type
    tty.c:521: error: dereferencing pointer to incomplete type
    tty.c:522: error: dereferencing pointer to incomplete type
    tty.c:523: error: dereferencing pointer to incomplete type
    tty.c:525: error: dereferencing pointer to incomplete type
    tty.c:525: error: dereferencing pointer to incomplete type
    tty.c:526: error: dereferencing pointer to incomplete type
    tty.c:526: error: dereferencing pointer to incomplete type
    tty.c:535: error: dereferencing pointer to incomplete type
    tty.c:535: error: dereferencing pointer to incomplete type
    tty.c:537: error: dereferencing pointer to incomplete type
    tty.c:537: error: dereferencing pointer to incomplete type
    tty.c:538: error: dereferencing pointer to incomplete type
    tty.c:538: error: dereferencing pointer to incomplete type
    tty.c:540: error: dereferencing pointer to incomplete type
    tty.c:540: error: dereferencing pointer to incomplete type
    tty.c:541: error: dereferencing pointer to incomplete type
    tty.c:541: error: dereferencing pointer to incomplete type
    tty.c:543: error: dereferencing pointer to incomplete type
    tty.c:543: error: dereferencing pointer to incomplete type
    tty.c:544: error: dereferencing pointer to incomplete type
    tty.c:544: error: dereferencing pointer to incomplete type
    tty.c:546: error: dereferencing pointer to incomplete type
    tty.c:546: error: dereferencing pointer to incomplete type
    tty.c:547: error: dereferencing pointer to incomplete type
    tty.c:547: error: dereferencing pointer to incomplete type
    tty.c:549: error: dereferencing pointer to incomplete type
    tty.c:549: error: dereferencing pointer to incomplete type
    tty.c: In Funktion »tty_init«:
    tty.c:558: error: dereferencing pointer to incomplete type
    tty.c:559: error: dereferencing pointer to incomplete type
    tty.c:560: error: dereferencing pointer to incomplete type
    tty.c:560: Warnung: Verarbeiten des Argumentes 2 von »memcpy« erzeugt Zeiger von Ganzzahl ohne Typkonvertierung
    tty.c:561: error: dereferencing pointer to incomplete type
    tty.c: In Funktion »tty_bind_char«:
    tty.c:763: error: dereferencing pointer to incomplete type
    tty.c:764: error: dereferencing pointer to incomplete type
    tty.c:771: error: dereferencing pointer to incomplete type
    tty.c:772: error: dereferencing pointer to incomplete type
    tty.c:773: error: dereferencing pointer to incomplete type
    tty.c:774: error: dereferencing pointer to incomplete type
    tty.c:775: error: dereferencing pointer to incomplete type
    tty.c:777: error: dereferencing pointer to incomplete type
    tty.c:791: error: dereferencing pointer to incomplete type
    tty.c:796: error: dereferencing pointer to incomplete type
    tty.c: In Funktion »tty_rawmode«:
    tty.c:809: error: dereferencing pointer to incomplete type
    tty.c:809: error: dereferencing pointer to incomplete type
    tty.c:812: error: dereferencing pointer to incomplete type
    tty.c:815: error: dereferencing pointer to incomplete type
    tty.c:815: error: dereferencing pointer to incomplete type
    tty.c:826: error: dereferencing pointer to incomplete type
    tty.c:826: error: dereferencing pointer to incomplete type
    tty.c:827: error: dereferencing pointer to incomplete type
    tty.c:827: error: dereferencing pointer to incomplete type
    tty.c:829: error: dereferencing pointer to incomplete type
    tty.c:829: error: dereferencing pointer to incomplete type
    tty.c:830: error: dereferencing pointer to incomplete type
    tty.c:830: error: dereferencing pointer to incomplete type
    tty.c:831: error: dereferencing pointer to incomplete type
    tty.c:831: error: dereferencing pointer to incomplete type
    tty.c:832: error: dereferencing pointer to incomplete type
    tty.c:832: error: dereferencing pointer to incomplete type
    tty.c:833: error: dereferencing pointer to incomplete type
    tty.c:833: error: dereferencing pointer to incomplete type
    tty.c:834: error: dereferencing pointer to incomplete type
    tty.c:834: error: dereferencing pointer to incomplete type
    tty.c:836: error: dereferencing pointer to incomplete type
    tty.c:837: error: dereferencing pointer to incomplete type
    tty.c:837: error: dereferencing pointer to incomplete type
    tty.c:838: error: dereferencing pointer to incomplete type
    tty.c:839: error: dereferencing pointer to incomplete type
    tty.c:840: error: dereferencing pointer to incomplete type
    tty.c:841: error: dereferencing pointer to incomplete type
    tty.c:842: error: dereferencing pointer to incomplete type
    tty.c:843: error: dereferencing pointer to incomplete type
    tty.c:845: error: dereferencing pointer to incomplete type
    tty.c:846: error: dereferencing pointer to incomplete type
    tty.c:847: error: dereferencing pointer to incomplete type
    tty.c:848: error: dereferencing pointer to incomplete type
    tty.c:849: error: dereferencing pointer to incomplete type
    tty.c:850: error: dereferencing pointer to incomplete type
    tty.c:852: error: dereferencing pointer to incomplete type
    tty.c:852: error: dereferencing pointer to incomplete type
    tty.c:853: error: dereferencing pointer to incomplete type
    tty.c:853: error: dereferencing pointer to incomplete type
    tty.c:854: error: dereferencing pointer to incomplete type
    tty.c:855: error: dereferencing pointer to incomplete type
    tty.c:856: error: dereferencing pointer to incomplete type
    tty.c:857: error: dereferencing pointer to incomplete type
    tty.c:858: error: dereferencing pointer to incomplete type
    tty.c:859: error: dereferencing pointer to incomplete type
    tty.c:861: error: dereferencing pointer to incomplete type
    tty.c:862: error: dereferencing pointer to incomplete type
    tty.c:863: error: dereferencing pointer to incomplete type
    tty.c:864: error: dereferencing pointer to incomplete type
    tty.c:865: error: dereferencing pointer to incomplete type
    tty.c:866: error: dereferencing pointer to incomplete type
    tty.c:868: error: dereferencing pointer to incomplete type
    tty.c:868: error: dereferencing pointer to incomplete type
    tty.c:869: error: dereferencing pointer to incomplete type
    tty.c:869: error: dereferencing pointer to incomplete type
    tty.c:870: error: dereferencing pointer to incomplete type
    tty.c:871: error: dereferencing pointer to incomplete type
    tty.c:872: error: dereferencing pointer to incomplete type
    tty.c:873: error: dereferencing pointer to incomplete type
    tty.c:874: error: dereferencing pointer to incomplete type
    tty.c:875: error: dereferencing pointer to incomplete type
    tty.c:877: error: dereferencing pointer to incomplete type
    tty.c:878: error: dereferencing pointer to incomplete type
    tty.c:879: error: dereferencing pointer to incomplete type
    tty.c:880: error: dereferencing pointer to incomplete type
    tty.c:881: error: dereferencing pointer to incomplete type
    tty.c:882: error: dereferencing pointer to incomplete type
    tty.c:884: error: dereferencing pointer to incomplete type
    tty.c:884: error: dereferencing pointer to incomplete type
    tty.c:885: error: dereferencing pointer to incomplete type
    tty.c:885: error: dereferencing pointer to incomplete type
    tty.c:886: error: dereferencing pointer to incomplete type
    tty.c:887: error: dereferencing pointer to incomplete type
    tty.c:888: error: dereferencing pointer to incomplete type
    tty.c:889: error: dereferencing pointer to incomplete type
    tty.c:890: error: dereferencing pointer to incomplete type
    tty.c:891: error: dereferencing pointer to incomplete type
    tty.c:893: error: dereferencing pointer to incomplete type
    tty.c:894: error: dereferencing pointer to incomplete type
    tty.c:895: error: dereferencing pointer to incomplete type
    tty.c:896: error: dereferencing pointer to incomplete type
    tty.c:897: error: dereferencing pointer to incomplete type
    tty.c:898: error: dereferencing pointer to incomplete type
    tty.c:900: error: dereferencing pointer to incomplete type
    tty.c:901: error: dereferencing pointer to incomplete type
    tty.c:903: error: dereferencing pointer to incomplete type
    tty.c:903: error: dereferencing pointer to incomplete type
    tty.c:908: error: dereferencing pointer to incomplete type
    tty.c:908: error: dereferencing pointer to incomplete type
    tty.c:915: error: dereferencing pointer to incomplete type
    tty.c:916: error: dereferencing pointer to incomplete type
    tty.c:925: error: dereferencing pointer to incomplete type
    tty.c:926: error: dereferencing pointer to incomplete type
    tty.c:926: error: dereferencing pointer to incomplete type
    tty.c:927: error: dereferencing pointer to incomplete type
    tty.c:927: error: dereferencing pointer to incomplete type
    tty.c:928: error: dereferencing pointer to incomplete type
    tty.c:929: error: dereferencing pointer to incomplete type
    tty.c:929: error: dereferencing pointer to incomplete type
    tty.c:932: error: dereferencing pointer to incomplete type
    tty.c:932: error: dereferencing pointer to incomplete type
    tty.c:935: error: dereferencing pointer to incomplete type
    tty.c:936: error: dereferencing pointer to incomplete type
    tty.c:936: error: dereferencing pointer to incomplete type
    tty.c:937: error: dereferencing pointer to incomplete type
    tty.c:937: error: dereferencing pointer to incomplete type
    tty.c:938: error: dereferencing pointer to incomplete type
    tty.c:939: error: dereferencing pointer to incomplete type
    tty.c:939: error: dereferencing pointer to incomplete type
    tty.c:941: error: dereferencing pointer to incomplete type
    tty.c:941: error: dereferencing pointer to incomplete type
    tty.c:945: error: dereferencing pointer to incomplete type
    tty.c:945: error: dereferencing pointer to incomplete type
    tty.c:952: error: dereferencing pointer to incomplete type
    tty.c: In Funktion »tty_cookedmode«:
    tty.c:964: error: dereferencing pointer to incomplete type
    tty.c:967: error: dereferencing pointer to incomplete type
    tty.c:970: error: dereferencing pointer to incomplete type
    tty.c:970: error: dereferencing pointer to incomplete type
    tty.c:978: error: dereferencing pointer to incomplete type
    tty.c: In Funktion »tty_quotemode«:
    tty.c:989: error: dereferencing pointer to incomplete type
    tty.c:992: error: dereferencing pointer to incomplete type
    tty.c:992: error: dereferencing pointer to incomplete type
    tty.c:994: error: dereferencing pointer to incomplete type
    tty.c:994: error: dereferencing pointer to incomplete type
    tty.c:995: error: dereferencing pointer to incomplete type
    tty.c:995: error: dereferencing pointer to incomplete type
    tty.c:997: error: dereferencing pointer to incomplete type
    tty.c:997: error: dereferencing pointer to incomplete type
    tty.c:998: error: dereferencing pointer to incomplete type
    tty.c:998: error: dereferencing pointer to incomplete type
    tty.c:1000: error: dereferencing pointer to incomplete type
    tty.c:1000: error: dereferencing pointer to incomplete type
    tty.c:1001: error: dereferencing pointer to incomplete type
    tty.c:1001: error: dereferencing pointer to incomplete type
    tty.c:1003: error: dereferencing pointer to incomplete type
    tty.c:1003: error: dereferencing pointer to incomplete type
    tty.c:1004: error: dereferencing pointer to incomplete type
    tty.c:1004: error: dereferencing pointer to incomplete type
    tty.c:1006: error: dereferencing pointer to incomplete type
    tty.c:1006: error: dereferencing pointer to incomplete type
    tty.c:1013: error: dereferencing pointer to incomplete type
    tty.c: In Funktion »tty_noquotemode«:
    tty.c:1025: error: dereferencing pointer to incomplete type
    tty.c:1027: error: dereferencing pointer to incomplete type
    tty.c:1027: error: dereferencing pointer to incomplete type
    tty.c:1034: error: dereferencing pointer to incomplete type
    tty.c: In Funktion »tty_stty«:
    tty.c:1046: error: Syntaxfehler before '*' token
    tty.c:1076: error: dereferencing pointer to incomplete type
    tty.c:1085: error: `m' undeclared (first use in this function)
    tty.c:1087: error: dereferencing pointer to incomplete type
    tty.c:1089: error: dereferencing pointer to incomplete type
    tty.c:1092: error: dereferencing pointer to incomplete type
    tty.c:1094: error: dereferencing pointer to incomplete type
    tty.c:1096: error: dereferencing pointer to incomplete type
    tty.c:1103: error: dereferencing pointer to incomplete type
    tty.c:1104: error: dereferencing pointer to incomplete type
    tty.c:1111: error: dereferencing pointer to incomplete type
    tty.c:1114: error: dereferencing pointer to incomplete type
    tty.c:1118: error: dereferencing pointer to incomplete type
    tty.c:1137: error: dereferencing pointer to incomplete type
    tty.c:1143: error: dereferencing pointer to incomplete type
    tty.c:1144: error: dereferencing pointer to incomplete type
    tty.c:1147: error: dereferencing pointer to incomplete type
    tty.c:1148: error: dereferencing pointer to incomplete type
    tty.c:1151: error: dereferencing pointer to incomplete type
    tty.c:1152: error: dereferencing pointer to incomplete type
    make[1]: *** [editline.o_a] Fehler 1
    make[1]: Leaving directory `/usr/src/asterisk/editline'
    make: *** [editline/libedit.a] Fehler 2
    
     
  2. HobbyStern

    HobbyStern Aktives Mitglied

    Registriert seit:
    5 Dez. 2005
    Beiträge:
    1,837
    Zustimmungen:
    0
    Punkte für Erfolge:
    36
    Beruf:
    vorhanden
    Ort:
    Ruhrgebiet
    Hi,

    Du hast Asterisk installiert und dieser läuft auch ?

    Mir (als Halblaien) liest sich die Geschichte so als ob die benötigten Asterisk-Komponenten fehlen (libedit etc)

    Ach stopp, ich sehe gerade "apt-get" ... vielleicht besser apt-get remove nutzen und die ganze Sache mal selber kompilieren.

    Eine kurze Anleitung dazu findest Du zB in Betateilchens Anleitung (im Forum unter "WICHTIG!" oder in einem Thread hier.

    Es ist wirklich nicht schwierig und sehr leicht verständlich, Debian ist eine gute Wahl, das schwerste stellt die Konfiguration des Asterisk dar...

    Grüsse, Stefan
     
  3. Freddchen

    Freddchen Neuer User

    Registriert seit:
    29 Dez. 2005
    Beiträge:
    7
    Zustimmungen:
    0
    Punkte für Erfolge:
    0
    danke für die antwort. habe heute eine neuinstalltion meines servers vorgenommen jetzt geht es ;) danke trotzdem nochmals.

    gruss
    freddchen