Hallo Leute habe das Problem, das make immer abbricht vielleicht kann mir einer helfen?
habe Kubuntu und wenig Ahnung von Linux
Code:
m/freetz-trunk/source/toolchain/target/binutils-2.17.50.0.17/bfd -I/home/pompom/freetz-trunk/source/toolchain/target/binutils-2.17.50.0.17/bfd/../include -W -Wall -Wstrict-prototypes -Wmissing-prototypes -g -O2 -c /home/pompom/freetz-trunk/source/toolchain/target/binutils-2.17.50.0.17/bfd/binary.c -o binary.o
/home/pompom/freetz-trunk/source/toolchain/target/binutils-2.17.50.0.17/bfd/linker.c: In function '_bfd_generic_link_write_global_symbol':
/home/pompom/freetz-trunk/source/toolchain/target/binutils-2.17.50.0.17/bfd/linker.c:2468: error: 'strip_al' undeclared (first use in this function)
/home/pompom/freetz-trunk/source/toolchain/target/binutils-2.17.50.0.17/bfd/linker.c:2468: error: (Each undeclared identifier is reported only once
/home/pompom/freetz-trunk/source/toolchain/target/binutils-2.17.50.0.17/bfd/linker.c:2468: error: for each function it appears in.)
/home/pompom/freetz-trunk/source/toolchain/target/binutils-2.17.50.0.17/bfd/linker.c:2469: error: expected expression before '||' token
/home/pompom/freetz-trunk/source/toolchain/target/binutils-2.17.50.0.17/bfd/linker.c:2469: warning: left-hand operand of comma expression has no effect
make[5]: *** [linker.lo] Fehler 1
make[5]: *** Warte auf noch nicht beendete Prozesse...
make[5]: Verlasse Verzeichnis '/home/pompom/freetz-trunk/source/toolchain/target/binutils-2.17.50.0.17-build/bfd'
make[4]: *** [all-recursive] Fehler 1
make[4]: Verlasse Verzeichnis '/home/pompom/freetz-trunk/source/toolchain/target/binutils-2.17.50.0.17-build/bfd'
make[3]: *** [all] Fehler 2
make[3]: Verlasse Verzeichnis '/home/pompom/freetz-trunk/source/toolchain/target/binutils-2.17.50.0.17-build/bfd'
make[2]: *** [all-bfd] Fehler 2
make[2]: Verlasse Verzeichnis '/home/pompom/freetz-trunk/source/toolchain/target/binutils-2.17.50.0.17-build'
make[1]: *** [all] Fehler 2
make[1]: Verlasse Verzeichnis '/home/pompom/freetz-trunk/source/toolchain/target/binutils-2.17.50.0.17-build'
make: *** [/home/pompom/freetz-trunk/source/toolchain/target/binutils-2.17.50.0.17-build/binutils/objdump] Fehler 2
habe Kubuntu und wenig Ahnung von Linux
Zuletzt bearbeitet: