.titleBar { margin-bottom: 5px!important; }

Erneut fehler beim compilieren von 2.6er Kernel DS Mod

Dieses Thema im Forum "Freetz" wurde erstellt von Seppl82, 24 Dez. 2006.

  1. Seppl82

    Seppl82 Neuer User

    Registriert seit:
    14 Okt. 2006
    Beiträge:
    23
    Zustimmungen:
    0
    Punkte für Erfolge:
    0
    Leider ist wieder ein Fehler aufgetreten (und diesmal hab ich die Suchfunktiona auch benutzt und nichts gefunden....

    Und zwar ging es so zuende...

    libtransmission/ratecontrol.c:98: error: expected ')' before '*' token
    libtransmission/ratecontrol.c:109: error: expected ')' before '*' token
    libtransmission/ratecontrol.c:136: error: expected ')' before '*' token
    libtransmission/ratecontrol.c:147: error: expected ')' before '*' token
    libtransmission/ratecontrol.c:163: error: expected ')' before '*' token

    /home/frsc/downloads/ds-0.2.9_26-12/toolchain/target/bin/mipsel-linux-uclibc-gcc -c -Os -W -Wall -pipe -Wa,--trap -msoft-float -mips32 -mtune=mips32 -O3 -Ili btransmission -o libtransmission/ratecontrol.o libtransmission/ratecontrol.c

    ...failed Cc libtransmission/ratecontrol.o...
    Cc libtransmission/choking.o
    libtransmission/choking.c: In function '__malloc':
    libtransmission/choking.c:30: error: 'NULL' undeclared (first use in this functi on)
    libtransmission/choking.c:30: error: (Each undeclared identifier is reported onl y once
    libtransmission/choking.c:30: error: for each function it appears in.)
    libtransmission/choking.c:31: warning: implicit declaration of function 'malloc'
    libtransmission/choking.c:31: warning: incompatible implicit declaration of buil t-in function 'malloc'
    libtransmission/choking.c: In function '__free':
    libtransmission/choking.c:36: warning: implicit declaration of function 'free'
    libtransmission/choking.c: At top level:
    libtransmission/choking.c:43: error: expected specifier-qualifier-list before 't r_lock_t'
    libtransmission/choking.c:48: error: expected '=', ',', ';', 'asm' or '__attribu te__' before '*' token
    libtransmission/choking.c:60: error: expected ')' before '*' token
    libtransmission/choking.c:78: error: expected ')' before '*' token
    libtransmission/choking.c:134: error: expected ')' before '*' token
    libtransmission/choking.c:326: error: expected ')' before '*' token

    /home/frsc/downloads/ds-0.2.9_26-12/toolchain/target/bin/mipsel-linux-uclibc-gcc -c -Os -W -Wall -pipe -Wa,--trap -msoft-float -mips32 -mtune=mips32 -O3 -Ili btransmission -o libtransmission/choking.o libtransmission/choking.c

    ...failed Cc libtransmission/choking.o...
    ...skipped libtransmission.a for lack of libtransmission.a(transmission.o)...
    Cc transmissioncli.o
    transmissioncli.c: In function 'main':
    transmissioncli.c:67: error: 'VERSION_STRING' undeclared (first use in this func tion)
    transmissioncli.c:67: error: (Each undeclared identifier is reported only once
    transmissioncli.c:67: error: for each function it appears in.)

    /home/frsc/downloads/ds-0.2.9_26-12/toolchain/target/bin/mipsel-linux-uclibc-gcc -c -Os -W -Wall -pipe -Wa,--trap -msoft-float -mips32 -mtune=mips32 -O3 -I. -I./libtransmission -o transmissioncli.o transmissioncli.c

    ...failed Cc transmissioncli.o...
    ...skipped transmissioncli for lack of transmissioncli.o...
    ...failed updating 15 targets...
    ...skipped 2 targets...
    ...updated 1 target...
    make: *** [source/Transmission-0.5/transmissioncli] Error 1
    frsc@brainfuck:~/downloads/ds-0.2.9_26-12>
     
  2. Tippfehler

    Tippfehler IPPF-Promi

    Registriert seit:
    14 Sep. 2004
    Beiträge:
    3,076
    Zustimmungen:
    7
    Punkte für Erfolge:
    38
    Ort:
    AB
  3. olistudent

    olistudent IPPF-Urgestein

    Registriert seit:
    19 Okt. 2004
    Beiträge:
    14,756
    Zustimmungen:
    1
    Punkte für Erfolge:
    0
    Beruf:
    Softwareentwickler
    Ort:
    Kaiserslautern
    Hm, das Problem hab ich nicht. Mach mal "make transmission-dirclean" und "make transmission-precompiled". Kommt der Fehler wieder?

    MfG Oliver
     
  4. Seppl82

    Seppl82 Neuer User

    Registriert seit:
    14 Okt. 2006
    Beiträge:
    23
    Zustimmungen:
    0
    Punkte für Erfolge:
    0
    Oh, wenn ich das mache, dann kommen fast nur errors (Hier mal ein Auszug vom Anfang)

    make transmission-precompiled
    tar -C source -v -xzf dl/Transmission-0.5.tar.gz
    Transmission-0.5/
    Transmission-0.5/AUTHORS
    Transmission-0.5/beos/
    Transmission-0.5/beos/libPrefs/
    Transmission-0.5/beos/libPrefs/libPrefs.a
    Transmission-0.5/beos/libPrefs/Prefs.h
    Transmission-0.5/beos/makefile
    Transmission-0.5/beos/Transmission.rsrc
    Transmission-0.5/beos/TRApplication.cpp
    Transmission-0.5/beos/TRApplication.h
    Transmission-0.5/beos/TRInfoWindow.cpp
    Transmission-0.5/beos/TRInfoWindow.h
    Transmission-0.5/beos/TRPrefsWindow.cpp
    Transmission-0.5/beos/TRPrefsWindow.h
    Transmission-0.5/beos/TRTransfer.cpp
    Transmission-0.5/beos/TRTransfer.h
    Transmission-0.5/beos/TRWindow.cpp
    Transmission-0.5/beos/TRWindow.h
    Transmission-0.5/configure
    Transmission-0.5/gtk/
    Transmission-0.5/gtk/conf.c
    Transmission-0.5/gtk/conf.h
    Transmission-0.5/gtk/dialogs.c
    Transmission-0.5/gtk/dialogs.h
    Transmission-0.5/gtk/Jamfile
    Transmission-0.5/gtk/main.c
    Transmission-0.5/gtk/po/
    Transmission-0.5/gtk/po/infiles
    Transmission-0.5/gtk/po/transmission-gtk.pot
    Transmission-0.5/gtk/trcellrenderertorrent.c
    Transmission-0.5/gtk/trcellrenderertorrent.h
    Transmission-0.5/gtk/util.c
    Transmission-0.5/gtk/util.h
    Transmission-0.5/Jamfile
    Transmission-0.5/Jamrules
    Transmission-0.5/libtransmission/
    Transmission-0.5/libtransmission/bencode.c
    Transmission-0.5/libtransmission/bencode.h
    Transmission-0.5/libtransmission/choking.c
    Transmission-0.5/libtransmission/choking.h
    Transmission-0.5/libtransmission/clients.c
    Transmission-0.5/libtransmission/clients.h
    Transmission-0.5/libtransmission/completion.c
    Transmission-0.5/libtransmission/completion.h
    Transmission-0.5/libtransmission/fastresume.h
    Transmission-0.5/libtransmission/fdlimit.c
    Transmission-0.5/libtransmission/fdlimit.h
    Transmission-0.5/libtransmission/inout.c
    Transmission-0.5/libtransmission/inout.h
    Transmission-0.5/libtransmission/internal.h
    Transmission-0.5/libtransmission/Jamfile
    Transmission-0.5/libtransmission/metainfo.c
    Transmission-0.5/libtransmission/metainfo.h
    Transmission-0.5/libtransmission/net.c
    Transmission-0.5/libtransmission/net.h
    Transmission-0.5/libtransmission/peer.c
    Transmission-0.5/libtransmission/peer.h
    Transmission-0.5/libtransmission/peermessages.h
    Transmission-0.5/libtransmission/peerparse.h
    Transmission-0.5/libtransmission/peerutils.h
    Transmission-0.5/libtransmission/platform.c
    Transmission-0.5/libtransmission/platform.h
    Transmission-0.5/libtransmission/ratecontrol.c
    Transmission-0.5/libtransmission/ratecontrol.h
    Transmission-0.5/libtransmission/sha1.c
    Transmission-0.5/libtransmission/sha1.h
    Transmission-0.5/libtransmission/tracker.c
    Transmission-0.5/libtransmission/tracker.h
    Transmission-0.5/libtransmission/transmission.c
    Transmission-0.5/libtransmission/transmission.h
    Transmission-0.5/libtransmission/utils.c
    Transmission-0.5/libtransmission/utils.h
    Transmission-0.5/LICENSE
    Transmission-0.5/macosx/
    Transmission-0.5/macosx/Applescript/
    Transmission-0.5/macosx/Applescript/Torrents_folder_action.scpt
    Transmission-0.5/macosx/Badger.h
    Transmission-0.5/macosx/Badger.m
    Transmission-0.5/macosx/Controller.h
    Transmission-0.5/macosx/Controller.m
    Transmission-0.5/macosx/Defaults.plist
    Transmission-0.5/macosx/English.lproj/
    Transmission-0.5/macosx/English.lproj/InfoPlist.strings
    Transmission-0.5/macosx/English.lproj/MainMenu.nib/
    Transmission-0.5/macosx/English.lproj/MainMenu.nib/classes.nib
    Transmission-0.5/macosx/English.lproj/MainMenu.nib/info.nib
    Transmission-0.5/macosx/English.lproj/MainMenu.nib/keyedobjects.nib
    Transmission-0.5/macosx/Images/
    Transmission-0.5/macosx/Images/Badge.png
    Transmission-0.5/macosx/Images/DownloadBadge.png
    Transmission-0.5/macosx/Images/Info.png
    Transmission-0.5/macosx/Images/Network.png
    Transmission-0.5/macosx/Images/Open.png
    Transmission-0.5/macosx/Images/PauseAll.png
    Transmission-0.5/macosx/Images/PauseOff.png
    Transmission-0.5/macosx/Images/PauseOn.png
    Transmission-0.5/macosx/Images/Preferences.png
    Transmission-0.5/macosx/Images/Progress.png
    Transmission-0.5/macosx/Images/Remove.png
    Transmission-0.5/macosx/Images/ResumeAll.png
    Transmission-0.5/macosx/Images/ResumeOff.png
    Transmission-0.5/macosx/Images/ResumeOn.png
    Transmission-0.5/macosx/Images/RevealOff.png
    Transmission-0.5/macosx/Images/RevealOn.png
    Transmission-0.5/macosx/Images/Transmission.icns
    Transmission-0.5/macosx/Images/TransmissionDocument.icns
    Transmission-0.5/macosx/Images/UploadBadge.png
    Transmission-0.5/macosx/Info.plist.in
    Transmission-0.5/macosx/main.m
    Transmission-0.5/macosx/NameCell.h
    Transmission-0.5/macosx/NameCell.m
    Transmission-0.5/macosx/PrefsController.h
    Transmission-0.5/macosx/PrefsController.m
    Transmission-0.5/macosx/ProgressCell.h
    Transmission-0.5/macosx/ProgressCell.m
    Transmission-0.5/macosx/StringAdditions.h
    Transmission-0.5/macosx/StringAdditions.m
    Transmission-0.5/macosx/Torrents_folder_action.scpt
    Transmission-0.5/macosx/TorrentTableView.h
    Transmission-0.5/macosx/TorrentTableView.m
    Transmission-0.5/macosx/Transmission.sdef
    Transmission-0.5/macosx/Transmission.xcodeproj/
    Transmission-0.5/macosx/Transmission.xcodeproj/project.pbxproj
    Transmission-0.5/macosx/Transmission_Prefix.pch
    Transmission-0.5/macosx/Utils.h
    Transmission-0.5/NEWS
    Transmission-0.5/README
    Transmission-0.5/transmissioncli.c
    for i in make/transmission/patches/*.patch; do \
    patch -d source/Transmission-0.5 -p0 < $i; \
    done
    patching file configure
    patching file configure
    patching file libtransmission/choking.c
    touch source/Transmission-0.5/.unpacked
    ( cd source/Transmission-0.5; \
    PATH="/home/frsc/downloads/ds-0.2.9_26-12/toolchain/target/bin:/bin:/sbin:/usr/bin:/usr/sbin" \
    CC="/home/frsc/downloads/ds-0.2.9_26-12/toolchain/target/bin/mipsel-linux-uclibc-gcc" \
    CFLAGS="-Os -W -Wall -pipe -Wa,--trap -msoft-float -mips32 -mtune=mips32" \
    CPPFLAGS="-I/home/frsc/downloads/ds-0.2.9_26-12/toolchain/target/bin/../usr/include" \
    LDFLAGS="-static-libgcc -L/home/frsc/downloads/ds-0.2.9_26-12/toolchain/target/bin/../usr/lib" \
    ./configure \
    --prefix=/usr \
    --disable-gtk \
    );
    System: Linux
    OpenSSL: no, using built-in SHA1 implementation
    GTK+: no

    To build Transmission, run 'jam'.
    touch source/Transmission-0.5/.configured
    ( cd source/Transmission-0.5; \
    jam \
    );
    libtransmission/Jamfile:9: in SubInclude
    warning: unknown rule ObjectDefines
    Jamfile:60: in module scope
    ...patience...
    ...found 200 targets...
    ...updating 18 targets...
    Cc libtransmission/transmission.o
    libtransmission/transmission.c: In function 'tr_init':
    libtransmission/transmission.c:43: warning: implicit declaration of function 'calloc'
    libtransmission/transmission.c:43: warning: incompatible implicit declaration of built-in function 'calloc'
    libtransmission/transmission.c:43: error: invalid application of 'sizeof' to incomplete type 'tr_handle_t'
    libtransmission/transmission.c:48: warning: implicit declaration of function 'sprintf'
    libtransmission/transmission.c:48: warning: incompatible implicit declaration of built-in function 'sprintf'
    libtransmission/transmission.c:48: error: dereferencing pointer to incomplete type
    libtransmission/transmission.c:48: error: 'VERSION_MAJOR' undeclared (first use in this function)
    libtransmission/transmission.c:48: error: (Each undeclared identifier is reported only once
    libtransmission/transmission.c:48: error: for each function it appears in.)
    libtransmission/transmission.c:48: error: 'VERSION_MINOR' undeclared (first use in this function)
    libtransmission/transmission.c:51: warning: implicit declaration of function 'tr_rand'
    libtransmission/transmission.c:52: error: dereferencing pointer to incomplete type
    libtransmission/transmission.c:59: error: dereferencing pointer to incomplete type
    libtransmission/transmission.c:63: warning: implicit declaration of function 'signal'
    libtransmission/transmission.c:63: error: 'SIGPIPE' undeclared (first use in this function)
    libtransmission/transmission.c:63: error: 'SIG_IGN' undeclared (first use in this function)
    libtransmission/transmission.c:66: error: dereferencing pointer to incomplete type
    libtransmission/transmission.c:66: warning: implicit declaration of function 'tr_rcInit'
    libtransmission/transmission.c:67: error: dereferencing pointer to incomplete type
    libtransmission/transmission.c:68: error: dereferencing pointer to incomplete type
    libtransmission/transmission.c:68: warning: implicit declaration of function 'tr_fdInit'
    libtransmission/transmission.c:69: error: dereferencing pointer to incomplete type
    libtransmission/transmission.c:69: warning: implicit declaration of function 'tr_chokingInit'
    libtransmission/transmission.c:71: error: dereferencing pointer to incomplete type
    libtransmission/transmission.c:72: error: dereferencing pointer to incomplete type
    libtransmission/transmission.c:77: warning: implicit declaration of function 'tr_fdSocketWillCreate'
    libtransmission/transmission.c:77: error: dereferencing pointer to incomplete type
    libtransmission/transmission.c:80: error: dereferencing pointer to incomplete type
    libtransmission/transmission.c:80: warning: implicit declaration of function 'tr_netBind'
    libtransmission/transmission.c:80: error: dereferencing pointer to incomplete type
    libtransmission/transmission.c:85: error: dereferencing pointer to incomplete type
    libtransmission/transmission.c:86: warning: implicit declaration of function 'tr_lockInit'
    libtransmission/transmission.c:86: error: dereferencing pointer to incomplete type
    libtransmission/transmission.c:87: warning: implicit declaration of function 'tr_threadCreate'
    libtransmission/transmission.c:87: error: dereferencing pointer to incomplete type
    libtransmission/transmission.c: In function 'tr_setBindPort':
    libtransmission/transmission.c:101: error: dereferencing pointer to incomplete type
    libtransmission/transmission.c:107: error: dereferencing pointer to incomplete type
    libtransmission/transmission.c:116: warning: implicit declaration of function 'tr_lockLock'
    libtransmission/transmission.c:116: error: dereferencing pointer to incomplete type
    libtransmission/transmission.c:118: error: dereferencing pointer to incomplete type
    libtransmission/transmission.c:120: error: dereferencing pointer to incomplete type
    libtransmission/transmission.c:122: error: dereferencing pointer to incomplete type
    libtransmission/transmission.c:123: error: 'NULL' undeclared (first use in this function)
    libtransmission/transmission.c:123: error: dereferencing pointer to incomplete type
    libtransmission/transmission.c:125: warning: implicit declaration of function 'tr_trackerChangePort'
    libtransmission/transmission.c:125: error: dereferencing pointer to incomplete type
    libtransmission/transmission.c:127: warning: implicit declaration of function 'tr_lockUnlock'
    libtransmission/transmission.c:127: error: dereferencing pointer to incomplete type
    libtransmission/transmission.c:130: error: dereferencing pointer to incomplete type
    libtransmission/transmission.c:132: warning: implicit declaration of function 'tr_netClose'
    libtransmission/transmission.c:132: error: dereferencing pointer to incomplete type
    libtransmission/transmission.c:133: warning: implicit declaration of function 'tr_fdSocketClosed'
    libtransmission/transmission.c:133: error: dereferencing pointer to incomplete type
    libtransmission/transmission.c:136: error: dereferencing pointer to incomplete type
    libtransmission/transmission.c:138: error: dereferencing pointer to incomplete type
    libtransmission/transmission.c: In function 'tr_setUploadLimit':
    libtransmission/transmission.c:148: warning: implicit declaration of function 'tr_rcSetLimit'
    libtransmission/transmission.c:148: error: dereferencing pointer to incomplete type
    libtransmission/transmission.c:149: warning: implicit declaration of function 'tr_chokingSetLimit'
    libtransmission/transmission.c:149: error: dereferencing pointer to incomplete type
    libtransmission/transmission.c: In function 'tr_torrentRates':
    libtransmission/transmission.c:159: error: 'tr_torrent_t' undeclared (first use in this function)
    libtransmission/transmission.c:159: error: 'tor' undeclared (first use in this function)
    libtransmission/transmission.c:164: error: dereferencing pointer to incomplete type
    libtransmission/transmission.c:166: error: dereferencing pointer to incomplete type
    libtransmission/transmission.c:169: warning: implicit declaration of function 'tr_rcRate'
    libtransmission/transmission.c: In function 'tr_torrentInit':
    libtransmission/transmission.c:183: error: 'tr_torrent_t' undeclared (first use in this function)
    libtransmission/transmission.c:183: error: 'tor' undeclared (first use in this function)
    libtransmission/transmission.c:188: error: dereferencing pointer to incomplete type
    libtransmission/transmission.c:190: warning: implicit declaration of function 'tr_err'
    libtransmission/transmission.c:194: warning: incompatible implicit declaration of built-in function 'calloc'
    libtransmission/transmission.c:198: warning: implicit declaration of function 'tr_metainfoParse'
    libtransmission/transmission.c:200: warning: implicit declaration of function 'free'
    libtransmission/transmission.c:205: error: dereferencing pointer to incomplete type
    libtransmission/transmission.c:207: warning: implicit declaration of function 'memcmp'
    libtransmission/transmission.c:207: error: dereferencing pointer to incomplete type
    libtransmission/transmission.c:217: error: dereferencing pointer to incomplete type
    libtransmission/transmission.c:218: error: dereferencing pointer to incomplete type
    libtransmission/transmission.c:223: warning: implicit declaration of function 'strchr'
    libtransmission/transmission.c:223: warning: incompatible implicit declaration of built-in function 'strchr'
    libtransmission/transmission.c:229: warning: implicit declaration of function 'strncmp'
    libtransmission/transmission.c:232: warning: implicit declaration of function 'strlen'
    libtransmission/transmission.c:232: warning: incompatible implicit declaration of built-in function 'strlen'
    libtransmission/transmission.c:233: warning: implicit declaration of function 'memcpy'
    libtransmission/transmission.c:233: warning: incompatible implicit declaration of built-in function 'memcpy'
    libtransmission/transmission.c:234: warning: incompatible implicit declaration of built-in function 'sprintf'
    libtransmission/transmission.c:241: warning: incompatible implicit declaration of built-in function 'sprintf'
    libtransmission/transmission.c:245: warning: implicit declaration of function 'MIN'
    libtransmission/transmission.c:248: warning: implicit declaration of function 'tr_cpInit'
    libtransmission/transmission.c:252: error: dereferencing pointer to incomplete type
    libtransmission/transmission.c:253: error: dereferencing pointer to incomplete type
    libtransmission/transmission.c:254: error: dereferencing pointer to incomplete type
    libtransmission/transmission.c:259: error: dereferencing pointer to incomplete type
    libtransmission/transmission.c:260: error: dereferencing pointer to incomplete type
    libtransmission/transmission.c:260: error: dereferencing pointer to incomplete type
    libtransmission/transmission.c:261: error: dereferencing pointer to incomplete type
    libtransmission/transmission.c:262: error: dereferencing pointer to incomplete type
    libtransmission/transmission.c: In function 'tr_torrentScrape':
    libtransmission/transmission.c:275: warning: implicit declaration of function 'tr_trackerScrape'
    libtransmission/transmission.c:275: error: dereferencing pointer to incomplete type
    libtransmission/transmission.c: In function 'tr_torrentSetFolder':
    libtransmission/transmission.c:280: error: 'tr_torrent_t' undeclared (first use in this function)
    libtransmission/transmission.c:280: error: 'tor' undeclared (first use in this function)
    libtransmission/transmission.c:280: error: dereferencing pointer to incomplete type
    libtransmission/transmission.c:282: warning: implicit declaration of function 'strdup'
    libtransmission/transmission.c:282: warning: incompatible implicit declaration of built-in function 'strdup'
    libtransmission/transmission.c: In function 'tr_torrentGetFolder':
    libtransmission/transmission.c:287: error: 'tr_torrent_t' undeclared (first use in this function)
    libtransmission/transmission.c:287: error: 'tor' undeclared (first use in this function)
    libtransmission/transmission.c:287: error: dereferencing pointer to incomplete type
    libtransmission/transmission.c: In function 'tr_torrentStart':
    libtransmission/transmission.c:294: error: 'tr_torrent_t' undeclared (first use in this function)
    libtransmission/transmission.c:294: error: 'tor' undeclared (first use in this function)
    libtransmission/transmission.c:294: error: dereferencing pointer to incomplete type
    libtransmission/transmission.c:303: warning: implicit declaration of function 'tr_trackerInit'
    libtransmission/transmission.c:305: warning: implicit declaration of function 'tr_date'
    libtransmission/transmission.c: In function 'tr_torrentStop':
    libtransmission/transmission.c:312: error: 'tr_torrent_t' undeclared (first use in this function)
    libtransmission/transmission.c:312: error: 'tor' undeclared (first use in this function)
    libtransmission/transmission.c:312: error: dereferencing pointer to incomplete type
    libtransmission/transmission.c:315: warning: implicit declaration of function 'tr_trackerStopped'
    libtransmission/transmission.c:316: warning: implicit declaration of function 'tr_rcReset'
    libtransmission/transmission.c: In function 'torrentReallyStop':
    libtransmission/transmission.c:330: error: 'tr_torrent_t' undeclared (first use in this function)
    libtransmission/transmission.c:330: error: 'tor' undeclared (first use in this function)
    libtransmission/transmission.c:330: error: dereferencing pointer to incomplete type
    libtransmission/transmission.c:333: warning: implicit declaration of function 'tr_threadJoin'
    libtransmission/transmission.c:334: warning: implicit declaration of function 'tr_dbg'
    libtransmission/transmission.c:336: warning: implicit declaration of function 'tr_trackerClose'
    libtransmission/transmission.c:340: warning: implicit declaration of function 'tr_peerRem'
    libtransmission/transmission.c: In function 'tr_torrentCount':
    libtransmission/transmission.c:351: error: dereferencing pointer to incomplete type
    libtransmission/transmission.c: In function 'tr_getFinished':
    libtransmission/transmission.c:356: error: dereferencing pointer to incomplete type
    libtransmission/transmission.c: In function 'tr_setFinished':
    libtransmission/transmission.c:360: error: dereferencing pointer to incomplete type
    libtransmission/transmission.c: In function 'tr_torrentStat':
    libtransmission/transmission.c:366: error: 'tr_torrent_t' undeclared (first use in this function)
    libtransmission/transmission.c:366: error: 'tor' undeclared (first use in this function)
    libtransmission/transmission.c:370: error: dereferencing pointer to incomplete type
    libtransmission/transmission.c:372: error: 'NULL' undeclared (first use in this function)
    libtransmission/transmission.c:376: warning: implicit declaration of function 'malloc'
    libtransmission/transmission.c:376: warning: incompatible implicit declaration of built-in function 'malloc'
    libtransmission/transmission.c:376: error: dereferencing pointer to incomplete type
    libtransmission/transmission.c:378: error: dereferencing pointer to incomplete type
    libtransmission/transmission.c:380: error: dereferencing pointer to incomplete type
    libtransmission/transmission.c:393: warning: incompatible implicit declaration of built-in function 'memcpy'
    libtransmission/transmission.c:403: warning: implicit declaration of function 'tr_peerIsConnected'
    libtransmission/transmission.c:406: warning: implicit declaration of function 'tr_peerIsUploading'
    libtransmission/transmission.c:410: warning: implicit declaration of function 'tr_peerIsDownloading'
    libtransmission/transmission.c:417: warning: implicit declaration of function 'tr_cpCompletionAsFloat'
    libtransmission/transmission.c:428: warning: implicit declaration of function 'tr_trackerSeeders'
    libtransmission/transmission.c:429: warning: implicit declaration of function 'tr_trackerLeechers'
    libtransmission/transmission.c:449: warning: implicit declaration of function 'tr_cpPieceIsComplete'
    libtransmission/transmission.c:459: warning: implicit declaration of function 'tr_peerBitfield'
    libtransmission/transmission.c:460: warning: implicit declaration of function 'tr_bitfieldHas'
    libtransmission/transmission.c:476: error: dereferencing pointer to incomplete type
    libtransmission/transmission.c: In function 'tr_torrentClose':
    libtransmission/transmission.c:486: error: 'tr_torrent_t' undeclared (first use in this function)
    libtransmission/transmission.c:486: error: 'tor' undeclared (first use in this function)
    libtransmission/transmission.c:486: error: dereferencing pointer to incomplete type
    libtransmission/transmission.c:495: error: dereferencing pointer to incomplete type
    libtransmission/transmission.c:497: error: dereferencing pointer to incomplete type
    libtransmission/transmission.c:499: warning: implicit declaration of function 'tr_lockClose'
    libtransmission/transmission.c:500: warning: implicit declaration of function 'tr_cpClose'
    libtransmission/transmission.c:502: warning: implicit declaration of function 'tr_rcClose'
    libtransmission/transmission.c:513: warning: implicit declaration of function 'memmove'
    libtransmission/transmission.c:513: warning: incompatible implicit declaration of built-in function 'memmove'
    libtransmission/transmission.c:513: error: dereferencing pointer to incomplete type
    libtransmission/transmission.c:513: error: dereferencing pointer to incomplete type
    libtransmission/transmission.c:514: error: dereferencing pointer to incomplete type
    libtransmission/transmission.c:516: error: dereferencing pointer to incomplete type
    libtransmission/transmission.c: In function 'tr_close':
    libtransmission/transmission.c:522: warning: implicit declaration of function 'tr_chokingClose'
    libtransmission/transmission.c:522: error: dereferencing pointer to incomplete type
    libtransmission/transmission.c:523: warning: implicit declaration of function 'tr_fdClose'
    libtransmission/transmission.c:523: error: dereferencing pointer to incomplete type
    libtransmission/transmission.c:524: error: dereferencing pointer to incomplete type
    libtransmission/transmission.c:525: error: dereferencing pointer to incomplete type
    libtransmission/transmission.c: In function 'downloadLoop':
    libtransmission/transmission.c:534: error: 'tr_torrent_t' undeclared (first use in this function)
    libtransmission/transmission.c:534: error: 'tor' undeclared (first use in this function)
    libtransmission/transmission.c:547: warning: implicit declaration of function 'tr_cpReset'
    libtransmission/transmission.c:548: warning: implicit declaration of function 'tr_ioInit'
    libtransmission/transmission.c:549: warning: implicit declaration of function 'tr_cpIsSeeding'
    libtransmission/transmission.c:563: warning: implicit declaration of function 'tr_trackerCompleted'
    libtransmission/transmission.c:564: warning: implicit declaration of function 'tr_ioSaveResume'
    libtransmission/transmission.c:568: warning: implicit declaration of function 'tr_peerPulse'
    libtransmission/transmission.c:571: warning: implicit declaration of function 'tr_trackerPulse'
    libtransmission/transmission.c:583: warning: implicit declaration of function 'tr_wait'
    libtransmission/transmission.c:590: warning: implicit declaration of function 'tr_ioClose'
    libtransmission/transmission.c: In function 'acceptLoop':
    libtransmission/transmission.c:615: error: dereferencing pointer to incomplete type
    libtransmission/transmission.c:617: error: dereferencing pointer to incomplete type
    libtransmission/transmission.c:622: error: dereferencing pointer to incomplete type
    libtransmission/transmission.c:623: error: dereferencing pointer to incomplete type
    libtransmission/transmission.c:623: error: 'TR_MAX_PEER_COUNT' undeclared (first use in this function)
    libtransmission/transmission.c:624: error: dereferencing pointer to incomplete type
    libtransmission/transmission.c:627: error: storage size of 'addr' isn't known
    libtransmission/transmission.c:628: error: 'in_port_t' undeclared (first use in this function)
    libtransmission/transmission.c:628: error: expected ';' before 'port'
    libtransmission/transmission.c:629: warning: implicit declaration of function 'tr_netAccept'
    libtransmission/transmission.c:629: error: dereferencing pointer to incomplete type
    libtransmission/transmission.c:629: error: 'port' undeclared (first use in this function)
    libtransmission/transmission.c:632: error: dereferencing pointer to incomplete type
    libtransmission/transmission.c:632: error: dereferencing pointer to incomplete type
    libtransmission/transmission.c:632: warning: implicit declaration of function 'tr_peerInit'
    libtransmission/transmission.c:636: error: dereferencing pointer to incomplete type
    libtransmission/transmission.c:627: warning: unused variable 'addr'
    libtransmission/transmission.c:640: error: dereferencing pointer to incomplete type
    libtransmission/transmission.c:642: warning: implicit declaration of function 'tr_peerRead'
    libtransmission/transmission.c:642: error: 'NULL' undeclared (first use in this function)
    libtransmission/transmission.c:642: error: dereferencing pointer to incomplete type
    libtransmission/transmission.c:644: warning: implicit declaration of function 'tr_peerDestroy'
    libtransmission/transmission.c:644: error: dereferencing pointer to incomplete type
    libtransmission/transmission.c:644: error: dereferencing pointer to incomplete type
    libtransmission/transmission.c:647: warning: implicit declaration of function 'tr_peerHash'
    libtransmission/transmission.c:647: error: dereferencing pointer to incomplete type
    libtransmission/transmission.c:647: warning: assignment makes pointer from integer without a cast
    libtransmission/transmission.c:649: error: dereferencing pointer to incomplete type
    libtransmission/transmission.c:651: error: dereferencing pointer to incomplete type
    libtransmission/transmission.c:652: error: dereferencing pointer to incomplete type
    libtransmission/transmission.c:655: warning: implicit declaration of function 'tr_peerAttach'
    libtransmission/transmission.c:655: error: dereferencing pointer to incomplete type
    libtransmission/transmission.c:655: error: dereferencing pointer to incomplete type
    libtransmission/transmission.c:656: error: dereferencing pointer to incomplete type
    libtransmission/transmission.c:659: error: dereferencing pointer to incomplete type
    libtransmission/transmission.c:661: error: dereferencing pointer to incomplete type
    libtransmission/transmission.c:661: error: dereferencing pointer to incomplete type
    libtransmission/transmission.c:667: error: dereferencing pointer to incomplete type
    libtransmission/transmission.c:668: warning: incompatible implicit declaration of built-in function 'memmove'
    libtransmission/transmission.c:668: error: dereferencing pointer to incomplete type
    libtransmission/transmission.c:668: error: dereferencing pointer to incomplete type
    libtransmission/transmission.c:669: error: dereferencing pointer to incomplete type
    libtransmission/transmission.c:669: error: 'tr_peer_t' undeclared (first use in this function)
    libtransmission/transmission.c:669: error: expected expression before ')' token
    libtransmission/transmission.c:674: warning: implicit declaration of function 'tr_chokingPulse'
    libtransmission/transmission.c:674: error: dereferencing pointer to incomplete type
    libtransmission/transmission.c:682: error: dereferencing pointer to incomplete type
    libtransmission/transmission.c:684: error: dereferencing pointer to incomplete type
    libtransmission/transmission.c:688: error: dereferencing pointer to incomplete type
    libtransmission/transmission.c: In function 'acceptStop':
    libtransmission/transmission.c:702: error: dereferencing pointer to incomplete type
    libtransmission/transmission.c:703: error: dereferencing pointer to incomplete type
    libtransmission/transmission.c:704: error: dereferencing pointer to incomplete type
    libtransmission/transmission.c:707: error: dereferencing pointer to incomplete type
    libtransmission/transmission.c:709: error: dereferencing pointer to incomplete type
    libtransmission/transmission.c:709: error: dereferencing pointer to incomplete type
    libtransmission/transmission.c:712: error: dereferencing pointer to incomplete type
    libtransmission/transmission.c:714: error: dereferencing pointer to incomplete type
    libtransmission/transmission.c:715: error: dereferencing pointer to incomplete type
    libtransmission/transmission.c: In function 'tr_torrentStat':
    libtransmission/transmission.c:477: warning: control reaches end of non-void function
    libtransmission/transmission.c: In function 'tr_getFinished':
    libtransmission/transmission.c:357: warning: control reaches end of non-void function
    libtransmission/transmission.c: In function 'tr_torrentCount':
    libtransmission/transmission.c:352: warning: control reaches end of non-void function
    libtransmission/transmission.c: In function 'tr_torrentGetFolder':
    libtransmission/transmission.c:290: warning: control reaches end of non-void function

    /home/frsc/downloads/ds-0.2.9_26-12/toolchain/target/bin/mipsel-linux-uclibc-gcc -c -Os -W -Wall -pipe -Wa,--trap -msoft-float -mips32 -mtune=mips32 -O3 -Ilibtransmission -o libtransmission/transmission.o libtransmission/transmission.c
     
  5. olistudent

    olistudent IPPF-Urgestein

    Registriert seit:
    19 Okt. 2004
    Beiträge:
    14,756
    Zustimmungen:
    1
    Punkte für Erfolge:
    0
    Beruf:
    Softwareentwickler
    Ort:
    Kaiserslautern
    Welche Version von jam hast du denn? (jam -v)
    Ich hab 2.5.

    MfG Oliver
     
  6. Seppl82

    Seppl82 Neuer User

    Registriert seit:
    14 Okt. 2006
    Beiträge:
    23
    Zustimmungen:
    0
    Punkte für Erfolge:
    0
    Also ich habe
    Boost.Jam Version 3.1.4. OS=LINUX.
    Copyright 1993-2002 Christopher Seiwald and Perforce Software, Inc.
    Copyright 2001 David Turner.
    Copyright 2001-2002 David Abrahams.

    Gruß
    Seppl
     
  7. olistudent

    olistudent IPPF-Urgestein

    Registriert seit:
    19 Okt. 2004
    Beiträge:
    14,756
    Zustimmungen:
    1
    Punkte für Erfolge:
    0
    Beruf:
    Softwareentwickler
    Ort:
    Kaiserslautern
    Ich hab mal gegoogelt. Und es sieht so aus als ob du auf Jam 2.5 downgraden musst...

    MfG Oliver
     
  8. Seppl82

    Seppl82 Neuer User

    Registriert seit:
    14 Okt. 2006
    Beiträge:
    23
    Zustimmungen:
    0
    Punkte für Erfolge:
    0
    Servus Oli,

    also hab jetzt mal auf 2.5 "downgegraded" (irgendwie netter anglizismus, aber upgegraded finde ich irgendwie noch besser ;) ).
    Jetzt konnte ich auch
    - make transmission-dirclean
    - make transmission-precompiled

    durchlaufen lassen.
    Ob das komplett durchläuft werden wir sehen (das dauert ja immer so lang zum compilieren).

    Danke dir für die Hilfe
    Seppl82