Beim erstellen eines Image für die w701v mit freetz r1907 erhalte ich folgenden Fehler:
Code:
applying patch file ./patches/W701V/110-rc.S-mknod.patch
patching file etc/init.d/rc.S
Hunk #1 FAILED at 239.
1 out of 1 hunk FAILED -- saving rejects to file etc/init.d/rc.S.rej
----------------------------------------------------------------------
ERROR: modpatch: Error in patch-file ./patches/W701V/110-rc.S-mknod.patch
make: *** [firmware-nocompile] Fehler 2