Fehler beim kompielieren von zaptel

tsc

Neuer User
Mitglied seit
20 Mai 2006
Beiträge
53
Punkte für Reaktionen
0
Punkte
0
Hallo, habe ein Suse 9.2 mit Kernel 2.6 und wollte jetzt Konferenzräume einrichten. Dazu wollte/muss ich zaptel installieren. Doch bringt er dann Fehler:
Code:
asterisk:/usr/src/zaptel-1.2.9 # make linux26
...
  CC [M]  /usr/src/zaptel-1.2.9/ztd-loc.o
  CC [M]  /usr/src/zaptel-1.2.9/ztdummy.o
make[5]: /usr/src/zaptel-1.2.9/wct4xxp/../oct612x/octasic-helper: Command not found
make[5]: /usr/src/zaptel-1.2.9/wct4xxp/../oct612x/octasic-helper: Command not found
  CC [M]  /usr/src/zaptel-1.2.9/wct4xxp/base.o
  HOSTCC  /usr/src/zaptel-1.2.9/wct4xxp/fw2h
/usr/src/zaptel-1.2.9/wct4xxp/fw2h /usr/src/zaptel-1.2.9/wct4xxp/OCT6114-128D.ima /usr/src/zaptel-1.2.9/wct4xxp/vpm450m_fw.h
make[5]: *** No rule to make target `/usr/src/zaptel-1.2.9/wct4xxp/../oct612x/include/oct6100api/oct6100_api.h', needed by `/usr/src/zaptel-1.2.9/wct4xxp/vpm450m.o'.  Stop.
make[4]: *** [/usr/src/zaptel-1.2.9/wct4xxp] Error 2
make[3]: *** [_module_/usr/src/zaptel-1.2.9] Error 2
make[2]: *** [modules] Error 2
make[1]: *** [modules] Error 2
make[1]: Leaving directory `/usr/src/linux-2.6.8-24-obj/x86_64/smp'
make: *** [linux26] Error 2
Von oct612x ist nirgends etwas zu sehen.
Jemand eine Idee?
 

kombjuder

IPPF-Promi
Mitglied seit
2 Nov 2004
Beiträge
3,086
Punkte für Reaktionen
0
Punkte
0

tsc

Neuer User
Mitglied seit
20 Mai 2006
Beiträge
53
Punkte für Reaktionen
0
Punkte
0

3CX PBX - GRATIS
Linux / Win / Cloud

Statistik des Forums

Themen
231,876
Beiträge
2,016,240
Mitglieder
348,972
Neuestes Mitglied
alexhpbh2