Fehlermeldung

bigmac

Neuer User
Mitglied seit
3 Nov 2004
Beiträge
14
Punkte für Reaktionen
0
Punkte
0
Tach zusammen,

ich habe ein kleines Problem. Beim Kompilieren von chan_capi 3.5 bekomme ich folgende Fehlermeldung:
chan_capi.c: In function `capi_new':
chan_capi.c:1073: error: structure has no member named `callerid'
chan_capi.c:1074: error: structure has no member named `dnid'
chan_capi.c: In function `pipe_msg':
chan_capi.c:1724: error: structure has no member named `dnid'
chan_capi.c:1724: error: structure has no member named `dnid'
chan_capi.c:1724: error: structure has no member named `dnid'
chan_capi.c:1724: error: structure has no member named `dnid'
chan_capi.c:1724: error: structure has no member named `dnid'
chan_capi.c:1724: error: structure has no member named `dnid'
chan_capi.c:1724: error: structure has no member named `dnid'
chan_capi.c:1724: error: structure has no member named `dnid'
chan_capi.c: In function `load_module':
chan_capi.c:2793: warning: passing arg 4 of `ast_channel_register' from incompatible pointer type
make: *** [chan_capi.o] Error 1

Hat jemand eine Idee

Grüße Marco
 
Erhalten Sie 3CX für 1 Jahr kostenlos!

Gehostet, in Ihrer privaten Cloud oder on-Premise! Ganz ohne Haken. Geben Sie Ihren Namen und Ihre E-Mail an und los geht´s:

3CX
Für diese E-Mail-Adresse besteht bereits ein 3CX-Konto. Sie werden zum Kundenportal weitergeleitet, wo Sie sich anmelden oder Ihr Passwort zurücksetzen können, falls Sie dieses vergessen haben.
oder via