.titleBar { margin-bottom: 5px!important; }

Freetz Labor Build 7590 Paket Asterisk schlägt fehl

Dieses Thema im Forum "Freetz" wurde erstellt von lowmaster, 19 Mai 2018.

  1. lowmaster

    lowmaster Neuer User

    Registriert seit:
    2 Sep. 2010
    Beiträge:
    58
    Zustimmungen:
    0
    Punkte für Erfolge:
    6
    Ich habe mal versucht die aktuelle Labor mit Asterisk zu bauen:

    Code:
    In file included from capifunc.c:42:0:
    capi20.h:65:16: error: unknown type name 'size_t'
         char *buf, size_t size);
                    ^
    capi20.h:67:16: error: unknown type name 'size_t'
         char *buf, size_t size);
                    ^
    make[1]: *** [capifunc.o] Fehler 1
    make[1]: *** Auf noch nicht beendete Prozesse wird gewartet …
    make[1]: Verzeichnis »/home/freetz/freetz-trunk/source/target-mips_gcc-5.5.0_uClibc-1.0.14-nptl_kernel-3.10/libcapi-avm-7390.05.50« wird verlassen
    
    ERROR: Build failed.
    make: *** [source/target-mips_gcc-5.5.0_uClibc-1.0.14-nptl_kernel-3.10/libcapi-avm-7390.05.50/libcapi20.so.3.0.4] Fehler 1
    freetz@freetz-linux:~/freetz-trunk$
    
     
  2. er13

    er13 Aktives Mitglied

    Registriert seit:
    20 Dez. 2005
    Beiträge:
    943
    Zustimmungen:
    12
    Punkte für Erfolge:
    18
    Das libcapi-related problem in r14692 behoben.

    Ob sich asterisk übersetzen lässt, nicht getestet.