fritzbox 7490 freetz-ng 7.24 Labor failed

The Hit-Man

Neuer User
Mitglied seit
2 Okt 2013
Beiträge
126
Punkte für Reaktionen
3
Punkte
18
ich habe mit das freetz image gebaut mit der firmware 07.1x und wird ohne probleme gebaut. nun wollte ich mal 07.2x und 07.24 ( labor ) testen und bekomme da diese meldung ...

Code:
In file included from ../../support/include/nfslib.h:22:0,
                 from client.c:24:
../../support/include/rpcsvc/nfs_prot.h:9:21: fatal error: rpc/rpc.h: No such file or directory
compilation terminated.
make[4]: *** [Makefile:453: client.o] Error 1
make[4]: *** Waiting for unfinished jobs....
In file included from ../../support/include/nfslib.h:22:0,
                 from export.c:19:
../../support/include/rpcsvc/nfs_prot.h:9:21: fatal error: rpc/rpc.h: No such file or directory
compilation terminated.
make[4]: *** [Makefile:453: export.o] Error 1
make[4]: Leaving directory '/home/u0/freetz/7490/freetz-ng/source/target-mips_gcc-5.5.0_uClibc-1.0.36-nptl_kernel-3.10/nfs-utils-1.3.4/support/export'
make[3]: *** [Makefile:395: all] Error 2
make[3]: Leaving directory '/home/u0/freetz/7490/freetz-ng/source/target-mips_gcc-5.5.0_uClibc-1.0.36-nptl_kernel-3.10/nfs-utils-1.3.4/support/export'
make[2]: *** [Makefile:427: all-recursive] Error 1
make[2]: Leaving directory '/home/u0/freetz/7490/freetz-ng/source/target-mips_gcc-5.5.0_uClibc-1.0.36-nptl_kernel-3.10/nfs-utils-1.3.4/support'
make[1]: *** [Makefile:469: all-recursive] Error 1
make[1]: Leaving directory '/home/u0/freetz/7490/freetz-ng/source/target-mips_gcc-5.5.0_uClibc-1.0.36-nptl_kernel-3.10/nfs-utils-1.3.4'

ERROR: Build failed.

hat da jemand nen tipp?
 

waldoo

Aktives Mitglied
Mitglied seit
28 Jan 2006
Beiträge
871
Punkte für Reaktionen
9
Punkte
18
ich kann das bei mir nicht nachvollziehen "nfs-utils-1.3.4" baut bei mir mit freetz-ng ganz normal mit der "7490_07.24.all-rev85840_labor"
hast du deine buildumgebung mal ganz normal bereinigt und die .config neu erstellt?
 

f666

Mitglied
Mitglied seit
6 Apr 2016
Beiträge
328
Punkte für Reaktionen
46
Punkte
28
Es fehlt ein Paket auf deinem Build System. Wurde hier schon öfters behandelt, sollte über die Suche auffindbar sein.
 

Zurzeit aktive Besucher

Keine Mitglieder online.

Neueste Beiträge

Statistik des Forums

Themen
241,486
Beiträge
2,164,920
Mitglieder
366,003
Neuestes Mitglied
VoBoss
Holen Sie sich 3CX - völlig kostenlos!
Verbinden Sie Ihr Team und Ihre Kunden Telefonie Livechat Videokonferenzen

Gehostet oder selbst-verwaltet. Für bis zu 10 Nutzer dauerhaft kostenlos. Keine Kreditkartendetails erforderlich. Ohne Risiko testen.

3CX
Für diese E-Mail-Adresse besteht bereits ein 3CX-Konto. Sie werden zum Kundenportal weitergeleitet, wo Sie sich anmelden oder Ihr Passwort zurücksetzen können, falls Sie dieses vergessen haben.