[gelöst] Build failed

µRaCoLi

Mitglied
Mitglied seit
22 Sep 2005
Beiträge
239
Punkte für Reaktionen
0
Punkte
0
Hab grad frisch ausgecheckt und der Build für ne 7050 schlägt fehl.
Code:
  removing cdrom.iso
    rm build/modified/filesystem/lib/modules/cdrom.iso
    patching build/modified/filesystem/etc/init.d/rc.S
    applying patch file ./patches/cond/rc.S-no-cdrom-fallback.patch
    patching file etc/init.d/rc.S
    Hunk #1 FAILED at 431.
    1 out of 1 hunk FAILED -- saving rejects to file etc/init.d/rc.S.rej
    ----------------------------------------------------------------------
ERROR: modpatch: Error in patch-file ./patches/cond/rc.S-no-cdrom-fallback.patch
make: *** [firmware-nocompile] Fehler 2
 

Anhänge

Zuletzt bearbeitet:
Danke. Behoben in r5435.

MfG Oliver
 
Danke für den schnellen Fix! Der dtrace-patch läuft bei mir auch nicht, weil die 7050 kein /usr/bin/dtrace hat.
 
Kostenlos!

Statistik des Forums

Themen
248,924
Beiträge
2,305,326
Mitglieder
378,652
Neuestes Mitglied
stego88