[gelöst] Stable-1.1 Fehler in usbstorage_7270.patch?

AndyFAQ

Neuer User
Mitglied seit
12 Dez 2006
Beiträge
123
Punkte für Reaktionen
0
Punkte
0
Ich wollte gerade mal die aktualisierte stable-1.1 testen, da bekam ich diesen Fehler

applying USB storage patch
applying patch file ./patches/cond/usbstorage_7270.patch
(Stripping trailing CRs from patch.)
patching file etc/hotplug/run_mount
Hunk #1 FAILED at 33.
Hunk #2 FAILED at 48.
Hunk #3 FAILED at 103.
3 out of 3 hunks FAILED -- saving rejects to file etc/hotplug/run_mount.rej
----------------------------------------------------------------------
ERROR: modpatch: Error in patch-file ./patches/cond/usbstorage_7270.patch
make: *** [firmware-nocompile] Fehler 2
 
Zuletzt bearbeitet:

olistudent

IPPF-Urgestein
Mitglied seit
19 Okt 2004
Beiträge
14,787
Punkte für Reaktionen
12
Punkte
38
Probier bitte nochmal. Gehts jetzt?
Ist irgendwas beim Mergen schief gelaufen...

MfG Oliver
 

AndyFAQ

Neuer User
Mitglied seit
12 Dez 2006
Beiträge
123
Punkte für Reaktionen
0
Punkte
0
Dank Dir. Läuft durch.

Gruß
Andreas
 

Erhalten Sie 3CX für 1 Jahr kostenlos!

Gehostet, in Ihrer privaten Cloud oder on-Premise! Ganz ohne Haken. Geben Sie Ihren Namen und Ihre E-Mail an und los geht´s:

3CX
Für diese E-Mail-Adresse besteht bereits ein 3CX-Konto. Sie werden zum Kundenportal weitergeleitet, wo Sie sich anmelden oder Ihr Passwort zurücksetzen können, falls Sie dieses vergessen haben.
oder via