.titleBar { margin-bottom: 5px!important; }

Kann Image für FritzBox 3170 nicht erstellen

Dieses Thema im Forum "Freetz" wurde erstellt von vistafan, 29 Okt. 2008.

  1. vistafan

    vistafan Neuer User

    Registriert seit:
    15 Feb. 2008
    Beiträge:
    2
    Zustimmungen:
    0
    Punkte für Erfolge:
    0
    #1 vistafan, 29 Okt. 2008
    Zuletzt bearbeitet: 29 Okt. 2008
    Hallo zusammen,

    ich bin schon seit gestern Abend am versuchen mir so ein Freetz Image zu erstellen, jedoch erhalte dabei ständig folgende Fehlermeldung:

    Code:
    kernel/intermodule.c:179: warning: `inter_module_register' is deprecated (declared at kernel/intermodule.c:38)
    kernel/intermodule.c:180: warning: `inter_module_unregister' is deprecated (declared at kernel/intermodule.c:79)
    kernel/intermodule.c:182: warning: `inter_module_put' is deprecated (declared at kernel/intermodule.c:160)
      CC      kernel/extable.o
      CC      kernel/params.o
      CC      kernel/posix-timers.o
      CC      mm/mempool.o
      CC      mm/oom_kill.o
      CC      mm/fadvise.o
      CC      kernel/kthread.o
      CC      kernel/wait.o
      CC      mm/page_alloc.o
      CC      kernel/kfifo.o
      CC      kernel/sys_ni.o
      CC      kernel/posix-cpu-timers.o
      CC      mm/page-writeback.o
      CC      kernel/env.o
      CC      kernel/dummy.o
      CC      mm/pdflush.o
      CC      kernel/module.o
      CC      mm/readahead.o
      CC      mm/slab.o
      CC      kernel/kallsyms.o
      CC      kernel/ksysfs.o
      CC      mm/swap.o
      CC      mm/truncate.o
      CC      kernel/irq/handle.o
      CC      mm/vmscan.o
      CC      mm/prio_tree.o
      CC      kernel/irq/manage.o
      CC      mm/fremap.o
      CC      kernel/irq/spurious.o
      CC      mm/highmem.o
      CC      kernel/irq/autoprobe.o
      CC      mm/madvise.o
      CC      kernel/irq/proc.o
      CC      mm/memory.o
      LD      kernel/irq/built-in.o
      LD      kernel/built-in.o
      CC      mm/mincore.o
      CC      mm/mlock.o
      CC      mm/mmap.o
      CC      mm/mprotect.o
      CC      fs/open.o
      CC      mm/mremap.o
      CC      mm/msync.o
      CC      fs/read_write.o
      CC      mm/rmap.o
      CC      fs/file_table.o
      CC      mm/vmalloc.o
      CC      fs/buffer.o
      CC      mm/page_io.o
      CC      mm/swap_state.o
      CC      mm/swapfile.o
      CC      fs/bio.o
      CC      fs/super.o
      CC      mm/thrash.o
      CC      fs/block_dev.o
      CC      mm/tiny-shmem.o
      CC      fs/char_dev.o
      LD      mm/built-in.o
      CC      fs/stat.o
      CC      fs/exec.o
      CC      fs/pipe.o
      CC      fs/namei.o
      CC      fs/fcntl.o
      CC      fs/ioctl.o
      CC      fs/readdir.o
      CC      fs/select.o
      CC      fs/fifo.o
      CC      fs/locks.o
      CC      fs/dcache.o
      CC      fs/inode.o
      CC      fs/attr.o
      CC      fs/bad_inode.o
      CC      fs/file.o
      CC      fs/filesystems.o
      CC      fs/namespace.o
      CC      fs/aio.o
      CC      fs/seq_file.o
      CC      fs/xattr.o
      CC      fs/libfs.o
      CC      fs/fs-writeback.o
      CC      fs/mpage.o
      CC      fs/direct-io.o
      CC      fs/ioprio.o
      CC      fs/inotify.o
      CC      fs/eventpoll.o
      CC      fs/nfsctl.o
      CC      fs/binfmt_script.o
      CC      fs/binfmt_elf.o
      CC      fs/devpts/inode.o
      LD      fs/devpts/devpts.o
      LD      fs/devpts/built-in.o
      CC      ipc/util.o
      CC      ipc/msgutil.o
      CC      ipc/msg.o
      CC      fs/nls/nls_base.o
      CC      ipc/sem.o
      LD      fs/nls/built-in.o
      CC      fs/partitions/check.o
      CC      ipc/shm.o
      LD      ipc/built-in.o
      CC      security/commoncap.o
      CC      fs/partitions/msdos.o
      LD      fs/partitions/built-in.o
      LD      security/built-in.o
      CC      crypto/api.o
      CC      fs/proc/mmu.o
      CC      crypto/scatterwalk.o
      CC      fs/proc/task_mmu.o
      CC      fs/proc/inode.o
      CC      crypto/cipher.o
      CC      fs/proc/root.o
      CC      crypto/digest.o
      CC      fs/proc/base.o
      CC      crypto/compress.o
      CC      crypto/proc.o
      LD      crypto/built-in.o
      CC      fs/proc/generic.o
      CC      fs/proc/array.o
      CC      fs/proc/kmsg.o
      CC      drivers/base/core.o
      CC      fs/proc/proc_tty.o
      CC      drivers/base/sys.o
      CC      fs/proc/proc_misc.o
      CC      drivers/base/bus.o
      CC      drivers/base/dd.o
      CC      fs/proc/kcore.o
      CC      drivers/base/driver.o
      LD      fs/proc/proc.o
      LD      fs/proc/built-in.o
      CC      drivers/base/class.o
      CC      fs/ramfs/inode.o
      CC      drivers/base/platform.o
      LD      fs/ramfs/ramfs.o
      LD      fs/ramfs/built-in.o
      CC      drivers/base/cpu.o
      CC      fs/squashfs/inode.o
      CC      drivers/base/firmware.o
      CC      drivers/base/init.o
      CC      drivers/base/map.o
      CC      drivers/base/dmapool.o
      CC      drivers/base/attribute_container.o
      CC      fs/squashfs/squashfs2_0.o
      CC      drivers/base/transport_class.o
      CC      fs/squashfs/LzmaDecode.o
      LD      fs/squashfs/squashfs.o
      LD      fs/squashfs/built-in.o
      CC      drivers/base/power/shutdown.o
      LD      drivers/base/power/built-in.o
      LD      drivers/base/built-in.o
      CC      fs/sysfs/inode.o
      CC      drivers/block/elevator.o
      CC      fs/sysfs/file.o
      CC      drivers/block/ll_rw_blk.o
      CC      fs/sysfs/dir.o
      CC      fs/sysfs/symlink.o
      CC      fs/sysfs/mount.o
      CC      drivers/block/ioctl.o
      CC      fs/sysfs/bin.o
      CC      drivers/block/genhd.o
      CC      fs/sysfs/group.o
      CC      drivers/block/scsi_ioctl.o
      LD      fs/sysfs/built-in.o
      LD      fs/built-in.o
      CC      drivers/block/noop-iosched.o
      LD      drivers/block/built-in.o
      CC      net/socket.o
      CC      drivers/char/mem.o
      CC      drivers/char/random.o
      CC      drivers/char/tty_io.o
      CC      net/802/p8023.o
      CC      drivers/char/n_tty.o
      CC      net/802/sysctl_net_802.o
      LD      net/802/built-in.o
      CC      drivers/char/tty_ioctl.o
      CC      net/8021q/vlan.o
      CC      drivers/char/pty.o
      CC      drivers/char/misc.o
      CC      net/8021q/vlan_dev.o
      CC      drivers/char/sysrq.o
      CC      net/8021q/vlanproc.o
      CC      drivers/char/avm_i2c/i2c_file.o
      LD      net/8021q/8021q.o
      LD      net/8021q/built-in.o
      CC      drivers/char/avm_i2c/i2c_main.o
      CC      net/atm/addr.o
      LD      drivers/char/avm_i2c/built-in.o
      CC      drivers/char/avm_net_trace/avm_net_trace.o
      CC      net/atm/pvc.o
      LD      drivers/char/avm_net_trace/built-in.o
      CC      net/atm/signaling.o
      CC      net/atm/svc.o
      CC      net/atm/ioctl.o
      CC      drivers/char/avm_new/avm_sammel.o
      CC      net/atm/common.o
      CC      drivers/char/avm_new/avm_led_init.o
      CC      net/atm/atm_misc.o
      CC      net/atm/raw.o
      CC      drivers/char/avm_new/avm_led_file.o
      CC      net/atm/resources.o
      CC      drivers/char/avm_new/avm_led_write.o
      CC      net/atm/ipcommon.o
      CC      drivers/char/avm_new/avm_led_event.o
      CC      net/atm/proc.o
      CC      drivers/char/avm_new/avm_led_mode.o
    drivers/char/avm_new/avm_led_mode.c:79: warning: large integer implicitly truncated to unsigned type
      CC      net/atm/br2684.o
      CC      drivers/char/avm_new/avm_led_if.o
      LD      net/atm/atm.o
      LD      net/atm/built-in.o
      CC      drivers/char/avm_new/avm_led_old.o
      CC      drivers/char/avm_new/avm_led_hardware_error.o
      CC      drivers/char/avm_new/avm_led_gpio_bit_driver.o
      CC      drivers/char/avm_new/avm_led_gpio_mask_driver.o
      CC      net/bridge/br.o
      CC      drivers/char/avm_new/avm_led_shift_register_bier_holen_driver.o
      CC      net/bridge/br_device.o
      CC      net/bridge/br_fdb.o
      CC      drivers/char/avm_new/avm_led_gpio_bier_holen_driver.o
      CC      drivers/char/avm_new/avm_led_shift_register_bit_driver.o
      CC      drivers/char/avm_new/avm_led_shift_register_mask_driver.o
      CC      net/bridge/br_forward.o
      CC      drivers/char/avm_new/avm_event_main.o
      CC      net/bridge/br_if.o
      CC      drivers/char/avm_new/avm_event_file.o
      CC      net/bridge/br_input.o
      CC      drivers/char/avm_new/avm_event_alloc.o
      CC      drivers/char/avm_new/avm_event_push_button.o
      CC      net/bridge/br_ioctl.o
    drivers/char/avm_new/avm_event_push_button.c:344: warning: initialization from incompatible pointer type
      CC      drivers/char/avm_new/ar7wdt_main.o
      CC      net/bridge/br_notify.o
      CC      drivers/char/avm_new/ar7wdt_file.o
      CC      net/bridge/br_stp.o
      CC      drivers/char/avm_new/ar7wdt_hw_26.o
      CC      net/bridge/br_stp_bpdu.o
      CC      drivers/char/avm_new/avm_debug.o
      CC      net/bridge/br_stp_if.o
      LD      drivers/char/avm_new/avm.o
      LD      drivers/char/avm_new/built-in.o
      CC      net/bridge/br_stp_timer.o
      CC      net/bridge/br_sysfs_if.o
      CC      drivers/char/avm_power/avm_power_file.o
      CC      net/bridge/br_sysfs_br.o
      CC      drivers/char/avm_power/wyatt_earp.o
      LD      net/bridge/bridge.o
      LD      net/bridge/built-in.o
      CC      drivers/char/avm_power/we_ethernet.o
      CC      drivers/char/avm_power/we_xilinx.o
      CC      drivers/char/avm_power/we_usb.o
      CC      drivers/char/avm_power/we_isdn.o
      CC      drivers/char/avm_power/we_led.o
      CC      drivers/char/avm_power/we_wlan.o
      CC      net/core/sock.o
      LD      drivers/char/avm_power/avm_power.o
      LD      drivers/char/avm_power/built-in.o
      CC      drivers/char/tffs-2.0/tffs_init.o
      CC      drivers/char/tffs-2.0/tffs_open.o
      CC      net/core/request_sock.o
      CC      drivers/char/tffs-2.0/tffs_read.o
      CC      net/core/skbuff.o
      CC      drivers/char/tffs-2.0/tffs_write.o
    drivers/char/tffs-2.0/tffs_write.c: In function `tffs_write':
    drivers/char/tffs-2.0/tffs_write.c:59: warning: assignment discards qualifiers from pointer target type
      CC      drivers/char/tffs-2.0/tffs_mtd.o
      CC      net/core/iovec.o
      CC      drivers/char/tffs-2.0/tffs_intern.o
      CC      net/core/datagram.o
      CC      drivers/char/tffs-2.0/tffs_proc.o
      CC      net/core/stream.o
      CC      drivers/char/tffs-2.0/tffs_ioctl.o
      CC      net/core/scm.o
      CC      drivers/char/tffs-2.0/tffs_panic.o
      LD      drivers/char/tffs-2.0/built-in.o
      CC      net/core/gen_stats.o
      LD      drivers/char/built-in.o
      CC      drivers/input/input.o
      CC      net/core/gen_estimator.o
      CC      net/core/sysctl_net_core.o
      CC      net/core/dev.o
      LD      drivers/input/built-in.o
      CC      drivers/isdn/capi/kcapi.o
      CC      drivers/isdn/capi/capiutil.o
      CC      net/core/ethtool.o
      CC      drivers/isdn/capi/capilib.o
      CC      drivers/isdn/capi/kcapi_proc.o
      CC      net/core/dev_mcast.o
      LD      drivers/isdn/capi/kernelcapi.o
      LD      drivers/isdn/capi/built-in.o
      CC      net/core/dst.o
      CC      net/core/neighbour.o
      CC      drivers/isdn/capi_oslib/appl.o
      CC      net/core/rtnetlink.o
      CC      drivers/isdn/capi_oslib/ca.o
      CC      net/core/utils.o
      CC      drivers/isdn/capi_oslib/ca_mem.o
      CC      net/core/link_watch.o
      CC      drivers/isdn/capi_oslib/ca_sched.o
      CC      net/core/filter.o
      CC      drivers/isdn/capi_oslib/ca_timer.o
      CC      net/core/net-sysfs.o
      CC      drivers/isdn/capi_oslib/local_capi.o
      CC      net/core/netfilter.o
      CC      drivers/isdn/capi_oslib/capi.o
      CC      net/core/wireless.o
      CC      drivers/isdn/capi_oslib/capi_events.o
      CC      drivers/isdn/capi_oslib/capi_pipe.o
      LD      net/core/built-in.o
      CC      drivers/isdn/capi_oslib/host.o
      CC      net/ethernet/eth.o
      CC      net/ethernet/sysctl_net_ether.o
      CC      drivers/isdn/capi_oslib/main.o
      LD      net/ethernet/built-in.o
      CC      net/ipv4/route.o
      CC      drivers/isdn/capi_oslib/transparent.o
      CC      drivers/isdn/capi_oslib/file.o
    drivers/isdn/capi_oslib/file.c: In function `capi_oslib_ioctl':
    drivers/isdn/capi_oslib/file.c:652: warning: ISO C90 forbids mixed declarations and code
    drivers/isdn/capi_oslib/file.c:665: warning: ISO C90 forbids mixed declarations and code
    drivers/isdn/capi_oslib/file.c:686: warning: ISO C90 forbids mixed declarations and code
    drivers/isdn/capi_oslib/file.c:699: warning: ISO C90 forbids mixed declarations and code
    drivers/isdn/capi_oslib/file.c:736: warning: ISO C90 forbids mixed declarations and code
      CC      drivers/isdn/capi_oslib/memmap.o
      CC      drivers/isdn/capi_oslib/debug.o
      CC      drivers/isdn/capi_oslib/socket_if.o
      CC      net/ipv4/inetpeer.o
      CC      net/ipv4/protocol.o
      LD      drivers/isdn/capi_oslib/capi_oslib.o
      LD      drivers/isdn/capi_oslib/built-in.o
      CC      net/ipv4/ip_input.o
      LD      drivers/isdn/built-in.o
      CC      net/ipv4/ip_fragment.o
      CC      net/ipv4/ip_forward.o
      CC      net/ipv4/ip_options.o
      CC      net/ipv4/ip_output.o
      CC      net/ipv4/ip_sockglue.o
      CC      drivers/mtd/mtdcore.o
      CC      net/ipv4/tcp.o
      CC      drivers/mtd/mtdpart.o
      CC      drivers/mtd/cmdlinepart.o
      CC      drivers/mtd/mtdchar.o
      CC      net/ipv4/tcp_input.o
      CC      drivers/mtd/mtdblock.o
      CC      drivers/mtd/mtd_blkdevs.o
      CC      drivers/mtd/chips/chipreg.o
      CC      drivers/mtd/chips/cfi_probe.o
      CC      net/ipv4/tcp_output.o
      CC      drivers/mtd/chips/cfi_util.o
      CC      net/ipv4/tcp_timer.o
      CC      drivers/mtd/chips/cfi_cmdset_0002.o
    drivers/mtd/chips/cfi_cmdset_0002.c: In function `cfi_amdstd_init':
    drivers/mtd/chips/cfi_cmdset_0002.c:1809: warning: `inter_module_register' is deprecated (declared at include/linux/module.h:569)
    drivers/mtd/chips/cfi_cmdset_0002.c: In function `cfi_amdstd_exit':
    drivers/mtd/chips/cfi_cmdset_0002.c:1816: warning: `inter_module_unregister' is deprecated (declared at include/linux/module.h:570)
      CC      net/ipv4/tcp_ipv4.o
      CC      drivers/mtd/chips/cfi_cmdset_0001.o
    drivers/mtd/chips/cfi_cmdset_0001.c: In function `cfi_intelext_init':
    drivers/mtd/chips/cfi_cmdset_0001.c:2364: warning: `inter_module_register' is deprecated (declared at include/linux/module.h:569)
    drivers/mtd/chips/cfi_cmdset_0001.c:2365: warning: `inter_module_register' is deprecated (declared at include/linux/module.h:569)
    drivers/mtd/chips/cfi_cmdset_0001.c: In function `cfi_intelext_exit':
    drivers/mtd/chips/cfi_cmdset_0001.c:2371: warning: `inter_module_unregister' is deprecated (declared at include/linux/module.h:570)
    drivers/mtd/chips/cfi_cmdset_0001.c:2372: warning: `inter_module_unregister' is deprecated (declared at include/linux/module.h:570)
    include/asm/atomic.h: In function `tcp_v4_err':
    include/asm/atomic.h:191: internal compiler error: Segmentation fault
    Please submit a full bug report,
    with preprocessed source if appropriate.
    See <URL:http://gcc.gnu.org/bugs.html> for instructions.
    make[3]: *** [net/ipv4/tcp_ipv4.o] Fehler 1
    make[2]: *** [net/ipv4] Fehler 2
    make[1]: *** [net] Fehler 2
    make[1]: *** Warte auf noch nicht beendete Prozesse...
      CC      drivers/mtd/chips/gen_probe.o
    drivers/mtd/chips/gen_probe.c: In function `cfi_cmdset_unknown':
    drivers/mtd/chips/gen_probe.c:240: warning: `inter_module_put' is deprecated (declared at include/linux/module.h:573)
      CC      drivers/mtd/chips/jedec_probe.o
      CC      drivers/mtd/chips/map_ram.o
      LD      drivers/mtd/chips/built-in.o
      CC      drivers/net/avm_cpmac/cpmac_main.o
      CC      drivers/mtd/maps/physmap.o
      CC      drivers/mtd/maps/plat-ram.o
    drivers/mtd/maps/plat-ram.c: In function `platram_probe':
    drivers/mtd/maps/plat-ram.c:178: warning: assignment discards qualifiers from pointer target type
      CC      drivers/mtd/maps/ohio-flash.o
    drivers/mtd/maps/ohio-flash.c: In function `ohio_find_hidden_filesystem':
    drivers/mtd/maps/ohio-flash.c:133: warning: unsigned int format, different type arg (arg 2)
    drivers/mtd/maps/ohio-flash.c:133: warning: unsigned int format, different type arg (arg 3)
      CC      drivers/net/avm_cpmac/cpmac_if.o
      LD      drivers/mtd/maps/built-in.o
      LD      drivers/mtd/built-in.o
      CC      drivers/net/avm_cpmac/cpphy_cppi.o
      LD      drivers/scsi/built-in.o
      CC      drivers/serial/serial_core.o
    drivers/serial/serial_core.c: In function `uart_add_one_port':
    drivers/serial/serial_core.c:2236: warning: unsigned int format, pointer arg (arg 2)
    drivers/serial/serial_core.c: At top level:
    drivers/serial/serial_core.c:2435: warning: `uart_register_port' is deprecated (declared at drivers/serial/serial_core.c:2356)
    drivers/serial/serial_core.c:2436: warning: `uart_unregister_port' is deprecated (declared at drivers/serial/serial_core.c:2413)
      CC      drivers/net/avm_cpmac/cpphy_if.o
      CC      drivers/serial/8250.o
    drivers/net/avm_cpmac/cpphy_if.c: In function `cpphy_if_control_req':
    drivers/net/avm_cpmac/cpphy_if.c:509: warning: implicit declaration of function `switch_dump'
      CC      drivers/net/avm_cpmac/cpphy_mdio.o
      CC      drivers/net/avm_cpmac/cpphy_main.o
      CC      drivers/net/avm_cpmac/cpphy_misc.o
      CC      drivers/serial/8250_early.o
      LD      drivers/serial/built-in.o
      CC      drivers/net/avm_cpmac/cpphy_adm6996.o
      LD      drivers/usb/class/built-in.o
      LD      drivers/usb/core/built-in.o
      LD      drivers/usb/misc/built-in.o
      LD      drivers/usb/mon/built-in.o
      CC      drivers/net/avm_cpmac/cpmac_eth.o
      LD      drivers/usb/serial/built-in.o
      LD      drivers/usb/storage/built-in.o
      LD      drivers/usb/built-in.o
      CC      drivers/net/avm_cpmac/cpmac_sched.o
      LD      drivers/video/backlight/built-in.o
      LD      drivers/video/built-in.o
      CC      drivers/net/avm_cpmac/cpphy_entry.o
    touch drivers/net/avm_cpmac/dummy.o
      LD      drivers/net/avm_cpmac/avm_cpmac.o
      LD      drivers/net/avm_cpmac/built-in.o
      CC      drivers/net/Space.o
      LD      drivers/net/wireless/built-in.o
      CC      drivers/net/loopback.o
      CC      drivers/net/tun.o
      LD      drivers/net/built-in.o
      LD      drivers/built-in.o
    make[1]: Leaving directory `/home/slightly/freetz-stable-1.0/source/ref-4mb_26-04.57/kernel/kernel_8mb_26_build/kernel/linux-2.6.13.1'
    make: *** [source/ref-4mb_26-04.57/kernel/kernel_8mb_26_build/kernel/linux-2.6.13.1/vmlinux.eva_pad] Fehler 2
    slightly@StinkyLinux:~/freetz-stable-1.0$
    
    Und das jedes mal :(.

    Als System mit dem ich kompliere benutze ich StinkyLinux in der VMWare, wie von der Freetz Seite empfohlen.
    Ich habe bereits dieses svn checkout durchgeführt, um den Ordner "Freetz-stable-1.0" zu erhalten, da dieser nur die neue Firmware für die 3170 unterstützt.

    Ich hoffe mir kann jemand weiterhelfen, denn ich finde den Ansatz von Freetz wirklich großartig.

    MfG

    Vistafan
     
  2. olistudent

    olistudent IPPF-Urgestein

    Registriert seit:
    19 Okt. 2004
    Beiträge:
    14,761
    Zustimmungen:
    5
    Punkte für Erfolge:
    38
    Beruf:
    Softwareentwickler
    Ort:
    Kaiserslautern
    Pack die Ausgabe bitte in Code-Tags.

    Mach mal bitte "make kernel-dirclean;make". Tritt der Fehler immer noch auf?
    Dann könntest du im menuconfig mal auswählen, dass eine eigen Toolchain gebaut wird. Ich hab noch nie gesehen, dass der gcc einen Segfault bringt.

    MfG Oliver
     
  3. vistafan

    vistafan Neuer User

    Registriert seit:
    15 Feb. 2008
    Beiträge:
    2
    Zustimmungen:
    0
    Punkte für Erfolge:
    0
    Hallo,

    leider tritt jetzt eine andere Fehlermeldung auf, s.u.

    Code:
    kernel/intermodule.c:179: warning: `inter_module_register' is deprecated (declared at kernel/intermodule.c:38)
    kernel/intermodule.c:180: warning: `inter_module_unregister' is deprecated (declared at kernel/intermodule.c:79)
    kernel/intermodule.c:182: warning: `inter_module_put' is deprecated (declared at kernel/intermodule.c:160)
      CC      kernel/extable.o
      CC      kernel/params.o
      CC      kernel/posix-timers.o
      CC      kernel/kthread.o
      CC      mm/mempool.o
      CC      kernel/wait.o
      CC      mm/oom_kill.o
      CC      mm/fadvise.o
      CC      kernel/kfifo.o
      CC      mm/page_alloc.o
      CC      kernel/sys_ni.o
      CC      kernel/posix-cpu-timers.o
      CC      mm/page-writeback.o
      CC      kernel/env.o
      CC      mm/pdflush.o
      CC      kernel/dummy.o
      CC      mm/readahead.o
      CC      mm/slab.o
      CC      mm/swap.o
      CC      mm/truncate.o
      CC      mm/vmscan.o
      CC      mm/prio_tree.o
      CC      mm/fremap.o
      CC      mm/highmem.o
      CC      mm/madvise.o
      CC      mm/memory.o
      CC      mm/mincore.o
      CC      mm/mlock.o
      CC      mm/mmap.o
      CC      mm/mprotect.o
      CC      mm/mremap.o
      CC      mm/msync.o
      CC      mm/rmap.o
      CC      mm/vmalloc.o
      CC      mm/page_io.o
      CC      kernel/module.o
      CC      mm/swap_state.o
      CC      mm/swapfile.o
      CC      kernel/kallsyms.o
      CC      mm/thrash.o
      CC      mm/tiny-shmem.o
      LD      mm/built-in.o
      CC      kernel/ksysfs.o
      CC      fs/open.o
      CC      kernel/irq/handle.o
      CC      kernel/irq/manage.o
      CC      fs/read_write.o
      CC      kernel/irq/spurious.o
      CC      fs/file_table.o
      CC      kernel/irq/autoprobe.o
      CC      fs/buffer.o
      CC      kernel/irq/proc.o
      LD      kernel/irq/built-in.o
      LD      kernel/built-in.o
      CC      ipc/util.o
      CC      fs/bio.o
      CC      ipc/msgutil.o
      CC      ipc/msg.o
      CC      fs/super.o
      CC      ipc/sem.o
      CC      fs/block_dev.o
      CC      ipc/shm.o
      CC      fs/char_dev.o
      LD      ipc/built-in.o
      CC      security/commoncap.o
      CC      fs/stat.o
      LD      security/built-in.o
      CC      crypto/api.o
      CC      fs/exec.o
      CC      crypto/scatterwalk.o
      CC      fs/pipe.o
      CC      crypto/cipher.o
      CC      crypto/digest.o
      CC      fs/namei.o
      CC      crypto/compress.o
      CC      crypto/proc.o
      LD      crypto/built-in.o
      LD      drivers/atm/built-in.o
      CC      fs/fcntl.o
      CC      fs/ioctl.o
      CC      fs/readdir.o
      CC      drivers/base/core.o
      CC      fs/select.o
      CC      drivers/base/sys.o
      CC      drivers/base/bus.o
      CC      drivers/base/dd.o
      CC      drivers/base/driver.o
      CC      drivers/base/class.o
      CC      fs/fifo.o
      CC      drivers/base/platform.o
      CC      fs/locks.o
      CC      drivers/base/cpu.o
      CC      drivers/base/firmware.o
      CC      drivers/base/init.o
      CC      fs/dcache.o
      CC      drivers/base/map.o
      CC      drivers/base/dmapool.o
      CC      drivers/base/attribute_container.o
      CC      fs/inode.o
      CC      fs/attr.o
      CC      fs/bad_inode.o
      CC      fs/file.o
      CC      drivers/base/transport_class.o
      CC      fs/filesystems.o
      CC      drivers/base/power/shutdown.o
      LD      drivers/base/power/built-in.o
      LD      drivers/base/built-in.o
      CC      fs/namespace.o
      CC      drivers/block/elevator.o
      CC      drivers/block/ll_rw_blk.o
      CC      fs/aio.o
      CC      fs/seq_file.o
      CC      drivers/block/ioctl.o
      CC      fs/xattr.o
      CC      drivers/block/genhd.o
      CC      fs/libfs.o
      CC      drivers/block/scsi_ioctl.o
      CC      fs/fs-writeback.o
      CC      fs/mpage.o
      CC      fs/direct-io.o
      CC      drivers/block/noop-iosched.o
      LD      drivers/block/built-in.o
      LD      drivers/bluetooth/built-in.o
      LD      drivers/cdrom/built-in.o
      CC      drivers/char/mem.o
      CC      fs/ioprio.o
      CC      fs/inotify.o
      CC      drivers/char/random.o
      CC      drivers/char/tty_io.o
      CC      fs/eventpoll.o
      CC      fs/nfsctl.o
      CC      fs/binfmt_script.o
      CC      drivers/char/n_tty.o
      CC      fs/binfmt_elf.o
      CC      drivers/char/tty_ioctl.o
      LD      fs/cifs/built-in.o
      CC      drivers/char/pty.o
      LD      fs/coda/built-in.o
      CC      fs/devpts/inode.o
      CC      drivers/char/misc.o
      LD      fs/devpts/devpts.o
      LD      fs/devpts/built-in.o
      LD      fs/exportfs/built-in.o
      LD      fs/ext2/built-in.o
      CC      drivers/char/sysrq.o
      LD      fs/ext3/built-in.o
      LD      fs/fat/built-in.o
      LD      fs/isofs/built-in.o
      LD      fs/jbd/built-in.o
      LD      fs/jffs2/built-in.o
      LD      fs/lockd/built-in.o
      LD      fs/mini_fo/built-in.o
      CC      drivers/char/avm_i2c/i2c_file.o
      LD      fs/msdos/built-in.o
      LD      fs/nfs/built-in.o
      LD      fs/nfs_common/built-in.o
      LD      fs/nfsd/built-in.o
      CC      fs/nls/nls_base.o
      CC      drivers/char/avm_i2c/i2c_main.o
      LD      drivers/char/avm_i2c/built-in.o
      LD      fs/nls/built-in.o
      CC      drivers/char/avm_net_trace/avm_net_trace.o
      CC      fs/partitions/check.o
      LD      drivers/char/avm_net_trace/built-in.o
      CC      drivers/char/avm_new/avm_sammel.o
      CC      fs/partitions/msdos.o
      CC      drivers/char/avm_new/avm_led_init.o
      LD      fs/partitions/built-in.o
      CC      drivers/char/avm_new/avm_led_file.o
      CC      fs/proc/mmu.o
      CC      fs/proc/task_mmu.o
      CC      fs/proc/inode.o
      CC      fs/proc/root.o
      CC      drivers/char/avm_new/avm_led_write.o
      CC      fs/proc/base.o
      CC      drivers/char/avm_new/avm_led_event.o
      CC      drivers/char/avm_new/avm_led_mode.o
    drivers/char/avm_new/avm_led_mode.c:79: warning: large integer implicitly truncated to unsigned type
      CC      fs/proc/generic.o
      CC      drivers/char/avm_new/avm_led_if.o
      CC      fs/proc/array.o
      CC      drivers/char/avm_new/avm_led_old.o
      CC      fs/proc/kmsg.o
      CC      drivers/char/avm_new/avm_led_hardware_error.o
      CC      fs/proc/proc_tty.o
      CC      drivers/char/avm_new/avm_led_gpio_bit_driver.o
      CC      fs/proc/proc_misc.o
      CC      drivers/char/avm_new/avm_led_gpio_mask_driver.o
      CC      drivers/char/avm_new/avm_led_shift_register_bier_holen_driver.o
      CC      fs/proc/kcore.o
      CC      drivers/char/avm_new/avm_led_gpio_bier_holen_driver.o
      LD      fs/proc/proc.o
      LD      fs/proc/built-in.o
      CC      drivers/char/avm_new/avm_led_shift_register_bit_driver.o
      CC      fs/ramfs/inode.o
      LD      fs/ramfs/ramfs.o
      LD      fs/ramfs/built-in.o
      CC      drivers/char/avm_new/avm_led_shift_register_mask_driver.o
      LD      fs/reiserfs/built-in.o
      CC      drivers/char/avm_new/avm_event_main.o
      LD      fs/smbfs/built-in.o
      CC      fs/squashfs/inode.o
      CC      drivers/char/avm_new/avm_event_file.o
      CC      drivers/char/avm_new/avm_event_alloc.o
      CC      fs/squashfs/squashfs2_0.o
      CC      drivers/char/avm_new/avm_event_push_button.o
    drivers/char/avm_new/avm_event_push_button.c:344: warning: initialization from incompatible pointer type
      CC      drivers/char/avm_new/ar7wdt_main.o
      CC      fs/squashfs/LzmaDecode.o
      LD      fs/squashfs/squashfs.o
      LD      fs/squashfs/built-in.o
      CC      drivers/char/avm_new/ar7wdt_file.o
      CC      fs/sysfs/inode.o
      CC      drivers/char/avm_new/ar7wdt_hw_26.o
      CC      fs/sysfs/file.o
      CC      drivers/char/avm_new/avm_debug.o
      CC      fs/sysfs/dir.o
      CC      fs/sysfs/symlink.o
      LD      drivers/char/avm_new/avm.o
      CC      fs/sysfs/mount.o
      LD      drivers/char/avm_new/built-in.o
      CC      drivers/char/avm_power/avm_power_file.o
      CC      fs/sysfs/bin.o
      CC      fs/sysfs/group.o
      LD      fs/sysfs/built-in.o
      CC      drivers/char/avm_power/wyatt_earp.o
      LD      fs/udf/built-in.o
      LD      fs/unionfs/built-in.o
      LD      fs/vfat/built-in.o
      LD      fs/built-in.o
      LD      sound/built-in.o
      CC      drivers/char/avm_power/we_ethernet.o
      LD      drivers/crypto/built-in.o
      CC      drivers/char/avm_power/we_xilinx.o
      CC      drivers/char/avm_power/we_usb.o
      LD      drivers/firmware/built-in.o
      CC      drivers/char/avm_power/we_isdn.o
      CC      drivers/input/input.o
      CC      drivers/char/avm_power/we_led.o
      LD      drivers/input/built-in.o
      CC      drivers/char/avm_power/we_wlan.o
      CC      drivers/isdn/capi/kcapi.o
      LD      drivers/char/avm_power/avm_power.o
      LD      drivers/char/avm_power/built-in.o
      CC      drivers/char/tffs-2.0/tffs_init.o
      CC      drivers/isdn/capi/capiutil.o
      CC      drivers/char/tffs-2.0/tffs_open.o
      CC      drivers/char/tffs-2.0/tffs_read.o
      CC      drivers/isdn/capi/capilib.o
      CC      drivers/char/tffs-2.0/tffs_write.o
      CC      drivers/isdn/capi/kcapi_proc.o
    drivers/char/tffs-2.0/tffs_write.c: In function `tffs_write':
    drivers/char/tffs-2.0/tffs_write.c:59: warning: assignment discards qualifiers from pointer target type
      CC      drivers/char/tffs-2.0/tffs_mtd.o
      LD      drivers/isdn/capi/kernelcapi.o
      LD      drivers/isdn/capi/built-in.o
      CC      drivers/isdn/capi_oslib/appl.o
      CC      drivers/char/tffs-2.0/tffs_intern.o
      CC      drivers/char/tffs-2.0/tffs_proc.o
      CC      drivers/char/tffs-2.0/tffs_ioctl.o
      CC      drivers/isdn/capi_oslib/ca.o
      CC      drivers/char/tffs-2.0/tffs_panic.o
      LD      drivers/char/tffs-2.0/built-in.o
      CC      drivers/isdn/capi_oslib/ca_mem.o
      LD      drivers/char/built-in.o
      LD      drivers/md/built-in.o
      LD      drivers/media/common/built-in.o
      CC      drivers/isdn/capi_oslib/ca_sched.o
      LD      drivers/media/dvb/b2c2/built-in.o
      LD      drivers/media/dvb/bt8xx/built-in.o
      CC      drivers/isdn/capi_oslib/ca_timer.o
      LD      drivers/media/dvb/cinergyT2/built-in.o
      LD      drivers/media/dvb/dvb-core/built-in.o
      LD      drivers/media/dvb/dvb-usb/built-in.o
      LD      drivers/media/dvb/frontends/built-in.o
      CC      drivers/isdn/capi_oslib/local_capi.o
      LD      drivers/media/dvb/pluto2/built-in.o
      LD      drivers/media/dvb/ttpci/built-in.o
      CC      drivers/isdn/capi_oslib/capi.o
      LD      drivers/media/dvb/ttusb-budget/built-in.o
      CC      drivers/isdn/capi_oslib/capi_events.o
      LD      drivers/media/dvb/ttusb-dec/built-in.o
      LD      drivers/media/dvb/built-in.o
      LD      drivers/media/radio/built-in.o
      CC      drivers/isdn/capi_oslib/capi_pipe.o
      LD      drivers/media/video/built-in.o
      LD      drivers/media/built-in.o
      LD      drivers/misc/built-in.o
      CC      drivers/isdn/capi_oslib/host.o
      CC      drivers/mtd/mtdcore.o
      CC      drivers/isdn/capi_oslib/main.o
      CC      drivers/mtd/mtdpart.o
      CC      drivers/isdn/capi_oslib/transparent.o
      CC      drivers/mtd/cmdlinepart.o
      CC      drivers/mtd/mtdchar.o
      CC      drivers/isdn/capi_oslib/file.o
    drivers/isdn/capi_oslib/file.c: In function `capi_oslib_ioctl':
    drivers/isdn/capi_oslib/file.c:652: warning: ISO C90 forbids mixed declarations and code
    drivers/isdn/capi_oslib/file.c:665: warning: ISO C90 forbids mixed declarations and code
    drivers/isdn/capi_oslib/file.c:686: warning: ISO C90 forbids mixed declarations and code
    drivers/isdn/capi_oslib/file.c:699: warning: ISO C90 forbids mixed declarations and code
    drivers/isdn/capi_oslib/file.c:736: warning: ISO C90 forbids mixed declarations and code
      CC      drivers/mtd/mtdblock.o
      CC      drivers/isdn/capi_oslib/memmap.o
      CC      drivers/mtd/mtd_blkdevs.o
      CC      drivers/isdn/capi_oslib/debug.o
      CC      drivers/isdn/capi_oslib/socket_if.o
      CC      drivers/mtd/chips/chipreg.o
      CC      drivers/mtd/chips/cfi_probe.o
      LD      drivers/isdn/capi_oslib/capi_oslib.o
      LD      drivers/isdn/capi_oslib/built-in.o
      LD      drivers/isdn/hardware/avm/built-in.o
      LD      drivers/isdn/hardware/built-in.o
      LD      drivers/isdn/built-in.o
      CC      drivers/mtd/chips/cfi_util.o
      CC      drivers/net/avm_cpmac/cpmac_main.o
      CC      drivers/mtd/chips/cfi_cmdset_0002.o
    drivers/mtd/chips/cfi_cmdset_0002.c: In function `cfi_amdstd_init':
    drivers/mtd/chips/cfi_cmdset_0002.c:1809: warning: `inter_module_register' is deprecated (declared at include/linux/module.h:569)
    drivers/mtd/chips/cfi_cmdset_0002.c: In function `cfi_amdstd_exit':
    drivers/mtd/chips/cfi_cmdset_0002.c:1816: warning: `inter_module_unregister' is deprecated (declared at include/linux/module.h:570)
      CC      drivers/mtd/chips/cfi_cmdset_0001.o
    drivers/mtd/chips/cfi_cmdset_0001.c: In function `cfi_intelext_init':
    drivers/mtd/chips/cfi_cmdset_0001.c:2364: warning: `inter_module_register' is deprecated (declared at include/linux/module.h:569)
    drivers/mtd/chips/cfi_cmdset_0001.c:2365: warning: `inter_module_register' is deprecated (declared at include/linux/module.h:569)
    drivers/mtd/chips/cfi_cmdset_0001.c: In function `cfi_intelext_exit':
    drivers/mtd/chips/cfi_cmdset_0001.c:2371: warning: `inter_module_unregister' is deprecated (declared at include/linux/module.h:570)
    drivers/mtd/chips/cfi_cmdset_0001.c:2372: warning: `inter_module_unregister' is deprecated (declared at include/linux/module.h:570)
      CC      drivers/mtd/chips/gen_probe.o
      CC      drivers/net/avm_cpmac/cpmac_if.o
    drivers/mtd/chips/gen_probe.c: In function `cfi_cmdset_unknown':
    drivers/mtd/chips/gen_probe.c:240: warning: `inter_module_put' is deprecated (declared at include/linux/module.h:573)
      CC      drivers/mtd/chips/jedec_probe.o
      CC      drivers/mtd/chips/map_ram.o
      LD      drivers/mtd/chips/built-in.o
      LD      drivers/mtd/devices/built-in.o
      CC      drivers/mtd/maps/physmap.o
      CC      drivers/mtd/maps/plat-ram.o
      CC      drivers/net/avm_cpmac/cpphy_cppi.o
    drivers/mtd/maps/plat-ram.c: In function `platram_probe':
    drivers/mtd/maps/plat-ram.c:178: warning: assignment discards qualifiers from pointer target type
      CC      drivers/mtd/maps/ohio-flash.o
    drivers/mtd/maps/ohio-flash.c: In function `ohio_find_hidden_filesystem':
    drivers/mtd/maps/ohio-flash.c:133: warning: unsigned int format, different type arg (arg 2)
    drivers/mtd/maps/ohio-flash.c:133: warning: unsigned int format, different type arg (arg 3)
      CC      drivers/net/avm_cpmac/cpphy_if.o
      LD      drivers/mtd/maps/built-in.o
      LD      drivers/mtd/nand/built-in.o
      LD      drivers/mtd/built-in.o
    drivers/net/avm_cpmac/cpphy_if.c: In function `cpphy_if_control_req':
    drivers/net/avm_cpmac/cpphy_if.c:509: warning: implicit declaration of function `switch_dump'
      LD      drivers/scsi/built-in.o
      CC      drivers/serial/serial_core.o
      CC      drivers/net/avm_cpmac/cpphy_mdio.o
    drivers/serial/serial_core.c: In function `uart_add_one_port':
    drivers/serial/serial_core.c:2236: warning: unsigned int format, pointer arg (arg 2)
    drivers/serial/serial_core.c: At top level:
    drivers/serial/serial_core.c:2435: warning: `uart_register_port' is deprecated (declared at drivers/serial/serial_core.c:2356)
    drivers/serial/serial_core.c:2436: warning: `uart_unregister_port' is deprecated (declared at drivers/serial/serial_core.c:2413)
      CC      drivers/net/avm_cpmac/cpphy_main.o
      CC      drivers/serial/8250.o
      CC      drivers/net/avm_cpmac/cpphy_misc.o
      CC      drivers/net/avm_cpmac/cpphy_adm6996.o
      CC      drivers/net/avm_cpmac/cpmac_eth.o
      CC      drivers/serial/8250_early.o
      CC      drivers/net/avm_cpmac/cpmac_sched.o
      LD      drivers/serial/built-in.o
      CC      drivers/net/avm_cpmac/cpphy_entry.o
      LD      drivers/usb/class/built-in.o
    touch drivers/net/avm_cpmac/dummy.o
      LD      drivers/net/avm_cpmac/avm_cpmac.o
      LD      drivers/net/avm_cpmac/built-in.o
      LD      drivers/usb/core/built-in.o
      LD      drivers/usb/misc/built-in.o
      LD      drivers/net/wireless/built-in.o
      LD      drivers/usb/mon/built-in.o
      CC      drivers/net/Space.o
      LD      drivers/usb/serial/built-in.o
      LD      drivers/usb/storage/built-in.o
      LD      drivers/usb/built-in.o
      LD      drivers/video/backlight/built-in.o
      LD      drivers/video/built-in.o
      CC      drivers/net/loopback.o
      CC      net/socket.o
      CC      drivers/net/tun.o
      CC      net/802/p8023.o
      LD      drivers/net/built-in.o
      LD      drivers/built-in.o
      CC      net/802/sysctl_net_802.o
      CC      lib/sort.o
      LD      net/802/built-in.o
      CC      net/8021q/vlan.o
      CC      lib/parser.o
      CC      lib/halfmd4.o
      CC      net/8021q/vlan_dev.o
      HOSTCC  lib/gen_crc32table
      CC      net/8021q/vlanproc.o
      LD      net/8021q/8021q.o
      LD      net/8021q/built-in.o
      CC      lib/zlib_deflate/deflate.o
      CC      net/atm/addr.o
      CC      lib/zlib_deflate/deftree.o
      CC      net/atm/pvc.o
      CC      net/atm/signaling.o
      CC      lib/zlib_deflate/deflate_syms.o
    include/asm/atomic.h: In function `sigd_send':
    include/asm/atomic.h:109: internal compiler error: Segmentation fault
    Please submit a full bug report,
    with preprocessed source if appropriate.
    See <URL:http://gcc.gnu.org/bugs.html> for instructions.
    make[3]: *** [net/atm/signaling.o] Fehler 1
    make[2]: *** [net/atm] Fehler 2
    make[1]: *** [net] Fehler 2
    make[1]: *** Warte auf noch nicht beendete Prozesse...
      LD      lib/zlib_deflate/zlib_deflate.o
      LD      lib/zlib_deflate/built-in.o
      CC      lib/bitmap.o
      CC      lib/zlib_inflate/infblock.o
      CC      lib/zlib_inflate/infcodes.o
      CC      lib/bust_spinlocks.o
      CC      lib/zlib_inflate/inffast.o
      CC      lib/cmdline.o
      CC      lib/ctype.o
      CC      lib/zlib_inflate/inflate.o
      CC      lib/div64.o
      CC      lib/zlib_inflate/inflate_sync.o
      CC      lib/dump_stack.o
      CC      lib/zlib_inflate/inftrees.o
      CC      lib/errno.o
      CC      lib/zlib_inflate/infutil.o
      CC      lib/zlib_inflate/inflate_syms.o
      CC      lib/extable.o
      LD      lib/zlib_inflate/zlib_inflate.o
      LD      lib/zlib_inflate/built-in.o
      CC      lib/idr.o
      CC      lib/int_sqrt.o
      CC      lib/klist.o
      CC      lib/kobject.o
      CC      lib/kobject_uevent.o
      CC      lib/kref.o
      CC      lib/prio_tree.o
      CC      lib/radix-tree.o
      CC      lib/rbtree.o
      CC      lib/rwsem-spinlock.o
      CC      lib/sha1.o
      CC      lib/string.o
      CC      lib/vsprintf.o
      GEN     lib/crc32table.h
      CC      lib/crc32.o
      AR      lib/lib.a
      LD      lib/built-in.o
    make[1]: Leaving directory `/home/slightly/freetz-stable-1.0/source/ref-4mb_26-04.57/kernel/kernel_8mb_26_build/kernel/linux-2.6.13.1'
    make: *** [source/ref-4mb_26-04.57/kernel/kernel_8mb_26_build/kernel/linux-2.6.13.1/vmlinux.eva_pad] Fehler 2
    
     
  4. olistudent

    olistudent IPPF-Urgestein

    Registriert seit:
    19 Okt. 2004
    Beiträge:
    14,761
    Zustimmungen:
    5
    Punkte für Erfolge:
    38
    Beruf:
    Softwareentwickler
    Ort:
    Kaiserslautern
    Ich hab keine Erklärung für diesen Fehler. Da stimmt irgendwas mit deiner Hardware nicht!? Oder mit der Emulation?

    MfG Oliver