.titleBar { margin-bottom: 5px!important; }

Probleme bei Installation einer HFC Karte

Dieses Thema im Forum "Asterisk ISDN Allgemein" wurde erstellt von zero_cold, 14 Feb. 2007.

  1. zero_cold

    zero_cold Neuer User

    Registriert seit:
    9 Feb. 2007
    Beiträge:
    25
    Zustimmungen:
    0
    Punkte für Erfolge:
    0
    ich habe versucht eine hfc karte nach dieser http://www.ip-phone-forum.de/showthread.php?t=92550anleitung einzurichten...

    wenn ich die kernelmodule laden will, mit
    cd /usr/src/bristuff-0.3.0-PRE-1f/zaphfc/
    make load
    bekomme ich folgende fehlermeldung:

    Asterisk:/usr/src/bristuff-0.3.0-PRE-1f/zaphfc # make load
    make -C /usr/src/linux/ SUBDIRS=/usr/src/bristuff-0.3.0-PRE-1f/zaphfc ZAP=-I/usr/src/bristuff-0.3.0-PRE-1f/zaptel-1.2.1 modules
    make[1]: Entering directory `/usr/src/linux-2.6.16.13-4'
    Makefile:450: .config: No such file or directory

    WARNING: Symbol version dump /usr/src/linux-2.6.16.13-4/Module.symvers
    is missing; modules will have no dependencies and modversions.

    CC [M] /usr/src/bristuff-0.3.0-PRE-1f/zaphfc/zaphfc.o
    /usr/src/bristuff-0.3.0-PRE-1f/zaphfc/zaphfc.c:921: error: expected ‘)’ before string constant
    /usr/src/bristuff-0.3.0-PRE-1f/zaphfc/zaphfc.c:922: error: expected ‘)’ before string constant
    /usr/src/bristuff-0.3.0-PRE-1f/zaphfc/zaphfc.c:923: error: expected ‘)’ before string constant
    /usr/src/bristuff-0.3.0-PRE-1f/zaphfc/zaphfc.c:924: error: expected ‘)’ before string constant
    /usr/src/bristuff-0.3.0-PRE-1f/zaphfc/zaphfc.c:925: error: expected ‘)’ before string constant
    make[2]: *** [/usr/src/bristuff-0.3.0-PRE-1f/zaphfc/zaphfc.o] Error 1
    make[1]: *** [_module_/usr/src/bristuff-0.3.0-PRE-1f/zaphfc] Error 2
    make[1]: Leaving directory `/usr/src/linux-2.6.16.13-4'
    make: *** [linux26] Error 2
    Asterisk:/usr/src/bristuff-0.3.0-PRE-1f/zaphfc # cat /proc/zaptel/1
    cat: /proc/zaptel/1: No such file or directory

    kann mir jemand weiterhelfen...komme hier nicht weiter..
     
  2. Netview

    Netview IPPF-Promi

    Registriert seit:
    1 Apr. 2004
    Beiträge:
    3,366
    Zustimmungen:
    0
    Punkte für Erfolge:
    36
    Beruf:
    Dipl.-Inf.
    Ort:
    Westerwald
    Ist doch eindeutig - diesen Pfad gibt es nicht:

    /usr/src/linux-2.6.16.13-4
     
  3. zero_cold

    zero_cold Neuer User

    Registriert seit:
    9 Feb. 2007
    Beiträge:
    25
    Zustimmungen:
    0
    Punkte für Erfolge:
    0
    doch diesen pfad gibt es..es liegen auch noch 18 unterordner drin und ein paar dateien...daran kann es also nicht liegen...es muss irgendwas anderes fehlen oder..?
     
  4. Netview

    Netview IPPF-Promi

    Registriert seit:
    1 Apr. 2004
    Beiträge:
    3,366
    Zustimmungen:
    0
    Punkte für Erfolge:
    36
    Beruf:
    Dipl.-Inf.
    Ort:
    Westerwald
    erstelle mal unter /usr/src folgenden symbolischen link mit:

    ln -s /usr/src/linux-2.6.16.13-4 /usr/src/linux26

    dann sollte es laufen!
     
  5. zero_cold

    zero_cold Neuer User

    Registriert seit:
    9 Feb. 2007
    Beiträge:
    25
    Zustimmungen:
    0
    Punkte für Erfolge:
    0
    hat leider nichts gebracht. kann es sein, dass er die datei .conf sucht und nicht findet. ich habe nämlich keine datei namens .conf in dem ordner:
    /usr/src/linux-2.6.16.13-4

    mfg
     
  6. Netview

    Netview IPPF-Promi

    Registriert seit:
    1 Apr. 2004
    Beiträge:
    3,366
    Zustimmungen:
    0
    Punkte für Erfolge:
    36
    Beruf:
    Dipl.-Inf.
    Ort:
    Westerwald
    sorry - hier fehlte ein '-' und '.'

    ln -s /usr/src/linux-2.6.16.13-4 /usr/src/linux-2.6

    Sollte der Fehler immer noch vorhanden sein und symvers fehlen wirst du wohl im kernel-Verzeichnis ein 'make' durchführen müssen!
     
  7. zero_cold

    zero_cold Neuer User

    Registriert seit:
    9 Feb. 2007
    Beiträge:
    25
    Zustimmungen:
    0
    Punkte für Erfolge:
    0
    ohje...das mit dem verlinken hat nicht geklappt...

    das make im kernel aber auch nicht...:confused:
    folgender fehler:
    Asterisk:/usr/src/linux-2.6.16.13-4 # make
    CHK /usr/src/linux-2.6.16.13-4/include/linux/version.h
    CHK include/linux/compile.h
    CHK usr/initramfs_list
    /usr/src/linux-2.6.16.13-4/scripts/gen_initramfs_list.sh: Cannot open 'y'
    make[1]: *** [usr/initramfs_list] Error 1
    make: *** [usr] Error 2
     
  8. carlofbf

    carlofbf Mitglied

    Registriert seit:
    28 Dez. 2005
    Beiträge:
    251
    Zustimmungen:
    0
    Punkte für Erfolge:
    0
    Beruf:
    Student
    Ort:
    Aachen
    hattest du deine kernel config im usr/src/linux?