.titleBar { margin-bottom: 5px!important; }

Bristuff auf frischen Debian

Dieses Thema im Forum "Linux allgemein" wurde erstellt von tom-tom, 26 Dez. 2004.

  1. tom-tom

    tom-tom Neuer User

    Registriert seit:
    18 Okt. 2004
    Beiträge:
    163
    Zustimmungen:
    0
    Punkte für Erfolge:
    0
    Hallo List,

    wünsche allen Frohe Weihnachten!
    Ich habe heute mal mein Debian Srage mit 2.4er kernel neu installiert danach habe ich die kernel Header und Kernel Sourcen sowie GVC per Apt-get installiert. Dann habe ich den neuen Bristuff (bri-stuff-0.0.2rc20a.tar) gesaugt und unter Windows mit Winrar entpackt und per WinSPC auf meine Debian Kiste in /usr/src kopiert. Rufe Ich nun ./install.sh auf kommt das hier:


    Code:
                     from /usr/src/linux-2.4/include/linux/sched.h:23,
                     from /usr/src/linux-2.4/include/linux/mm.h:4,
                     from /usr/src/linux-2.4/include/linux/slab.h:14,
                     from /usr/src/linux-2.4/include/linux/proc_fs.h:5,
                     from zaptel.c:45:
    /usr/include/asm/io_apic.h:120: error: `MAX_IRQ_SOURCES' undeclared here (not in a function)
    /usr/include/asm/io_apic.h:120: error: conflicting types for `mp_irqs'
    /usr/include/asm/mpspec.h:22: error: previous declaration of `mp_irqs'
    In Datei, eingefügt von /usr/src/linux-2.4/include/linux/smp.h:14,
                        von /usr/src/linux-2.4/include/linux/sched.h:23,
                        von /usr/src/linux-2.4/include/linux/mm.h:4,
                        von /usr/src/linux-2.4/include/linux/slab.h:14,
                        von /usr/src/linux-2.4/include/linux/proc_fs.h:5,
                        von zaptel.c:45:
    /usr/include/asm/smp.h:73:26: mach_apicdef.h: Datei oder Verzeichnis nicht gefunden
    In file included from /usr/include/asm/siginfo.h:4,
                     from /usr/src/linux-2.4/include/linux/signal.h:5,
                     from /usr/src/linux-2.4/include/linux/sched.h:26,
                     from /usr/src/linux-2.4/include/linux/mm.h:4,
                     from /usr/src/linux-2.4/include/linux/slab.h:14,
                     from /usr/src/linux-2.4/include/linux/proc_fs.h:5,
                     from zaptel.c:45:
    /usr/include/asm-generic/siginfo.h:51: error: Fehler beim Parsen before "timer_t"
    /usr/include/asm-generic/siginfo.h:87: error: Fehler beim Parsen before '}' token
    /usr/include/asm-generic/siginfo.h:88: error: Fehler beim Parsen before '}' token
    /usr/include/asm-generic/siginfo.h: In Funktion »copy_siginfo«:
    /usr/include/asm-generic/siginfo.h:278: error: structure has no member named `_sifields'
    /usr/include/asm-generic/siginfo.h:278: error: structure has no member named `_sifields'
    /usr/include/asm-generic/siginfo.h:278: error: structure has no member named `_sifields'
    In file included from /usr/src/linux-2.4/include/linux/sched.h:26,
                     from /usr/src/linux-2.4/include/linux/mm.h:4,
                     from /usr/src/linux-2.4/include/linux/slab.h:14,
                     from /usr/src/linux-2.4/include/linux/proc_fs.h:5,
                     from zaptel.c:45:
    /usr/src/linux-2.4/include/linux/signal.h: Auf höchster Ebene:
    /usr/src/linux-2.4/include/linux/signal.h:14: error: Fehler beim Parsen before "siginfo_t"
    /usr/src/linux-2.4/include/linux/signal.h:14: Warnung: kein Semikolon am Ende von »struct« oder »union«
    In file included from /usr/src/linux-2.4/include/linux/sched.h:28,
                     from /usr/src/linux-2.4/include/linux/mm.h:4,
                     from /usr/src/linux-2.4/include/linux/slab.h:14,
                     from /usr/src/linux-2.4/include/linux/proc_fs.h:5,
                     from zaptel.c:45:
    /usr/src/linux-2.4/include/linux/fs_struct.h: In Funktion »set_fs_root«:
    /usr/src/linux-2.4/include/linux/fs_struct.h:34: Warnung: implicit declaration of function `write_lock'
    /usr/src/linux-2.4/include/linux/fs_struct.h:39: Warnung: implicit declaration of function `write_unlock'
    In file included from /usr/src/linux-2.4/include/linux/mm.h:4,
                     from /usr/src/linux-2.4/include/linux/slab.h:14,
                     from /usr/src/linux-2.4/include/linux/proc_fs.h:5,
                     from zaptel.c:45:
    /usr/src/linux-2.4/include/linux/sched.h: Auf höchster Ebene:
    /usr/src/linux-2.4/include/linux/sched.h:624: error: Fehler beim Parsen before "siginfo_t"
    /usr/src/linux-2.4/include/linux/sched.h:624: Warnung: function declaration isn't a prototype
    /usr/src/linux-2.4/include/linux/sched.h:807: error: conflicting types for `kernel_thread'
    /usr/include/asm/processor.h:492: error: previous declaration of `kernel_thread'
    /usr/src/linux-2.4/include/linux/sched.h: In Funktion »d_path«:
    /usr/src/linux-2.4/include/linux/sched.h:937: Warnung: implicit declaration of function `read_lock'
    /usr/src/linux-2.4/include/linux/sched.h:940: Warnung: implicit declaration of function `read_unlock'
    In Datei, eingefügt von /usr/src/linux-2.4/include/linux/vmalloc.h:8,
                        von /usr/include/asm/io.h:46,
                        von /usr/include/asm/pci.h:39,
                        von /usr/src/linux-2.4/include/linux/pci.h:683,
                        von zaptel.c:46:
    /usr/src/linux-2.4/include/linux/highmem.h:87:36: Makro »clear_user_page« erfordert 3 Argumente, aber nur 2 wurden angegeben
    In file included from /usr/src/linux-2.4/include/linux/vmalloc.h:8,
                     from /usr/include/asm/io.h:46,
                     from /usr/include/asm/pci.h:39,
                     from /usr/src/linux-2.4/include/linux/pci.h:683,
                     from zaptel.c:46:
    /usr/src/linux-2.4/include/linux/highmem.h: In Funktion »clear_user_highpage«:
    /usr/src/linux-2.4/include/linux/highmem.h:87: error: `clear_user_page' undeclared (first use in this function)
    /usr/src/linux-2.4/include/linux/highmem.h:87: error: (Each undeclared identifier is reported only once
    /usr/src/linux-2.4/include/linux/highmem.h:87: error: for each function it appears in.)
    /usr/src/linux-2.4/include/linux/highmem.h:119:41: Makro »copy_user_page« erfordert 4 Argumente, aber nur 3 wurden angegeben
    /usr/src/linux-2.4/include/linux/highmem.h: In Funktion »copy_user_highpage«:
    /usr/src/linux-2.4/include/linux/highmem.h:119: error: `copy_user_page' undeclared (first use in this function)
    In file included from /usr/include/linux/dma-mapping.h:13,
                     from /usr/include/asm-generic/pci-dma-compat.h:7,
                     from /usr/include/asm/pci.h:92,
                     from /usr/src/linux-2.4/include/linux/pci.h:683,
                     from zaptel.c:46:
    /usr/include/asm/dma-mapping.h: In Funktion »dma_set_mask«:
    /usr/include/asm/dma-mapping.h:112: error: dereferencing pointer to incomplete type
    /usr/include/asm/dma-mapping.h:115: error: dereferencing pointer to incomplete type
    In file included from /usr/include/asm/pci.h:92,
                     from /usr/src/linux-2.4/include/linux/pci.h:683,
                     from zaptel.c:46:
    /usr/include/asm-generic/pci-dma-compat.h: In Funktion »pci_dma_supported«:
    /usr/include/asm-generic/pci-dma-compat.h:15: error: structure has no member named `dev'
    /usr/include/asm-generic/pci-dma-compat.h: In Funktion »pci_alloc_consistent«:
    /usr/include/asm-generic/pci-dma-compat.h:22: error: structure has no member named `dev'
    /usr/include/asm-generic/pci-dma-compat.h: In Funktion »pci_free_consistent«:
    /usr/include/asm-generic/pci-dma-compat.h:29: error: structure has no member named `dev'
    /usr/include/asm-generic/pci-dma-compat.h: In Funktion »pci_map_single«:
    /usr/include/asm-generic/pci-dma-compat.h:35: error: structure has no member named `dev'
    /usr/include/asm-generic/pci-dma-compat.h: In Funktion »pci_unmap_single«:
    /usr/include/asm-generic/pci-dma-compat.h:42: error: structure has no member named `dev'
    /usr/include/asm-generic/pci-dma-compat.h: In Funktion »pci_map_page«:
    /usr/include/asm-generic/pci-dma-compat.h:49: error: structure has no member named `dev'
    /usr/include/asm-generic/pci-dma-compat.h: In Funktion »pci_unmap_page«:
    /usr/include/asm-generic/pci-dma-compat.h:56: error: structure has no member named `dev'
    /usr/include/asm-generic/pci-dma-compat.h: In Funktion »pci_map_sg«:
    /usr/include/asm-generic/pci-dma-compat.h:63: error: structure has no member named `dev'
    /usr/include/asm-generic/pci-dma-compat.h: In Funktion »pci_unmap_sg«:
    /usr/include/asm-generic/pci-dma-compat.h:70: error: structure has no member named `dev'
    /usr/include/asm-generic/pci-dma-compat.h: In Funktion »pci_dma_sync_single«:
    /usr/include/asm-generic/pci-dma-compat.h:77: error: structure has no member named `dev'
    /usr/include/asm-generic/pci-dma-compat.h: In Funktion »pci_dma_sync_sg«:
    /usr/include/asm-generic/pci-dma-compat.h:84: error: structure has no member named `dev'
    In file included from /usr/include/asm/pci.h:95,
                     from /usr/src/linux-2.4/include/linux/pci.h:683,
                     from zaptel.c:46:
    /usr/include/asm-generic/pci.h: In Funktion »pcibios_resource_to_bus«:
    /usr/include/asm-generic/pci.h:21: error: dereferencing pointer to incomplete type
    /usr/include/asm-generic/pci.h:22: error: dereferencing pointer to incomplete type
    zaptel.c: In Funktion »zaptel_proc_read«:
    zaptel.c:434: Warnung: use of cast expressions as lvalues is deprecated
    zaptel.c: In Funktion »zt_qevent_lock«:
    zaptel.c:641: error: Fehler beim Parsen before "unsigned"
    zaptel.c: In Funktion »zt_reallocbufs«:
    zaptel.c:737: error: Fehler beim Parsen before "unsigned"
    zaptel.c: In Funktion »close_channel«:
    zaptel.c:927: error: Fehler beim Parsen before "unsigned"
    zaptel.c: In Funktion »zt_chan_reg«:
    zaptel.c:1134: error: Fehler beim Parsen before "unsigned"
    zaptel.c: In Funktion »zt_chan_unreg«:
    zaptel.c:1508: error: Fehler beim Parsen before "unsigned"
    zaptel.c: In Funktion »zt_chan_read«:
    zaptel.c:1527: error: Fehler beim Parsen before "unsigned"
    zaptel.c:1533: error: Fehler beim Parsen before "unsigned"
    zaptel.c:1586: error: Fehler beim Parsen before "unsigned"
    zaptel.c: In Funktion »zt_chan_write«:
    zaptel.c:1611: error: Fehler beim Parsen before "unsigned"
    zaptel.c:1615: error: Fehler beim Parsen before "unsigned"
    zaptel.c:1681: error: Fehler beim Parsen before "unsigned"
    zaptel.c: In Funktion »initialize_channel«:
    zaptel.c:2003: error: Fehler beim Parsen before "unsigned"
    zaptel.c: In Funktion »zt_timing_open«:
    zaptel.c:2029: error: Fehler beim Parsen before "unsigned"
    zaptel.c: In Funktion »zt_timer_release«:
    zaptel.c:2054: error: Fehler beim Parsen before "unsigned"
    zaptel.c: In Funktion »zt_open«:
    zaptel.c:2187: error: Fehler beim Parsen before "unsigned"
    zaptel.c: In Funktion »zt_release«:
    zaptel.c:2486: error: Fehler beim Parsen before "unsigned"
    zaptel.c: In Funktion »zt_timer_ioctl«:
    zaptel.c:2546: error: Fehler beim Parsen before "unsigned"
    zaptel.c:2554: error: Fehler beim Parsen before "unsigned"
    zaptel.c:2564: error: Fehler beim Parsen before "unsigned"
    zaptel.c:2570: error: Fehler beim Parsen before "unsigned"
    zaptel.c:2575: error: Fehler beim Parsen before "unsigned"
    zaptel.c: In Funktion »zt_common_ioctl«:
    zaptel.c:2776: error: Fehler beim Parsen before "unsigned"
    zaptel.c: In Funktion »zt_ctl_ioctl«:
    zaptel.c:2897: error: Fehler beim Parsen before "unsigned"
    zaptel.c:2944: error: Fehler beim Parsen before "unsigned"
    zaptel.c:3046: error: Fehler beim Parsen before "unsigned"
    zaptel.c:3059: error: Fehler beim Parsen before "unsigned"
    zaptel.c:3086: error: Fehler beim Parsen before "unsigned"
    zaptel.c:3150: error: Fehler beim Parsen before "unsigned"
    zaptel.c:3158: error: Fehler beim Parsen before "unsigned"
    zaptel.c:3168: error: Fehler beim Parsen before "unsigned"
    zaptel.c: In Funktion »zt_chanandpseudo_ioctl«:
    zaptel.c:3203: error: Fehler beim Parsen before "unsigned"
    zaptel.c:3242: error: Fehler beim Parsen before "unsigned"
    zaptel.c:3321: error: Fehler beim Parsen before "unsigned"
    zaptel.c:3329: error: Fehler beim Parsen before "unsigned"
    zaptel.c:3371: error: Fehler beim Parsen before "unsigned"
    zaptel.c:3398: error: Fehler beim Parsen before "unsigned"
    zaptel.c:3405: error: Fehler beim Parsen before "unsigned"
    zaptel.c:3417: error: Fehler beim Parsen before "unsigned"
    zaptel.c:3425: error: Fehler beim Parsen before "unsigned"
    zaptel.c:3432: error: Fehler beim Parsen before "unsigned"
    zaptel.c:3474: error: Fehler beim Parsen before "unsigned"
    zaptel.c:3475: error: Fehler beim Parsen before "unsigned"
    zaptel.c:3497: error: Fehler beim Parsen before "unsigned"
    zaptel.c:3498: error: Fehler beim Parsen before "unsigned"
    zaptel.c:3517: error: Fehler beim Parsen before "unsigned"
    zaptel.c:3518: error: Fehler beim Parsen before "unsigned"
    zaptel.c:3568: error: Fehler beim Parsen before "unsigned"
    zaptel.c:3569: error: Fehler beim Parsen before "unsigned"
    zaptel.c: In Funktion »zt_chan_ioctl«:
    zaptel.c:3703: error: Fehler beim Parsen before "unsigned"
    zaptel.c:3732: error: Fehler beim Parsen before "unsigned"
    zaptel.c:3850: error: Fehler beim Parsen before "unsigned"
    zaptel.c:3861: error: Fehler beim Parsen before "unsigned"
    zaptel.c:3902: error: Fehler beim Parsen before "unsigned"
    zaptel.c:3908: error: Fehler beim Parsen before "unsigned"
    zaptel.c:3912: error: Fehler beim Parsen before "unsigned"
    zaptel.c:3918: error: Fehler beim Parsen before "unsigned"
    zaptel.c:3928: error: Fehler beim Parsen before "unsigned"
    zaptel.c:3940: error: Fehler beim Parsen before "unsigned"
    zaptel.c:3944: error: Fehler beim Parsen before "unsigned"
    zaptel.c:3953: error: Fehler beim Parsen before "unsigned"
    zaptel.c:3957: error: Fehler beim Parsen before "unsigned"
    zaptel.c:3966: error: Fehler beim Parsen before "unsigned"
    zaptel.c: In Funktion »zt_hooksig«:
    zaptel.c:4899: error: Fehler beim Parsen before "unsigned"
    zaptel.c: In Funktion »zt_rbsbits«:
    zaptel.c:4952: error: Fehler beim Parsen before "unsigned"
    zaptel.c: In Funktion »zt_ec_chunk«:
    zaptel.c:5003: error: Fehler beim Parsen before "unsigned"
    zaptel.c: In Funktion »process_timers«:
    zaptel.c:5522: error: Fehler beim Parsen before "unsigned"
    zaptel.c: In Funktion »zt_timer_poll«:
    zaptel.c:5535: error: Fehler beim Parsen before "unsigned"
    zaptel.c: In Funktion »zt_chan_poll«:
    zaptel.c:5567: error: Fehler beim Parsen before "unsigned"
    zaptel.c: In Funktion »zt_transmit«:
    zaptel.c:5750: error: Fehler beim Parsen before "unsigned"
    zaptel.c: In Funktion »zt_receive«:
    zaptel.c:5842: error: Fehler beim Parsen before "unsigned"
    zaptel.c:5864: error: Fehler beim Parsen before "unsigned"
    zaptel.c:5874: error: Fehler beim Parsen before "unsigned"
    zaptel.c:5900: error: Fehler beim Parsen before "unsigned"
    zaptel.c:5911: error: Fehler beim Parsen before "unsigned"
    zaptel.c:5914: error: Fehler beim Parsen before "unsigned"
    make: *** [zaptel.o] Fehler 1
    ****************************************************
    ZAPTEL installed.
    Press <Enter> to continue, or <CTRL> + <C> to abort.
    ****************************************************
    
    Ich muss irgendetwas grundlegend falsch machen, weil Ich das andauernd habe egal auf welcher Distri oder welcher Hardware Ich installiere. Kann mir jemand helfen?
     
  2. rajo

    rajo Admin-Team

    Registriert seit:
    31 März 2004
    Beiträge:
    1,958
    Zustimmungen:
    0
    Punkte für Erfolge:
    36
    a) entpacken kann man auch unter linux mit "tar xvf dateiname.tar"
    und wenn es ein tar.gz oder tgz ist, dann mit "tar xvzf dateiname"

    b) mach mal:
    cd /usr/src/linux
    ls /boot/
    dort sollte eine datei config-2.4 sonstwie rumliegen
    cp /boot/config-2.4 .config
    make oldconfig
    make dep
    cd /dorthin/wo/der/bristuff/liegt
    ./install.sh
     
  3. tom-tom

    tom-tom Neuer User

    Registriert seit:
    18 Okt. 2004
    Beiträge:
    163
    Zustimmungen:
    0
    Punkte für Erfolge:
    0
    Danke für die Antwort!
    Leider wird die Error Liste nicht kürzer

    Code:
    Datei oder Verzeichnis nicht gefunden
    /usr/src/linux-2.4/include/linux/modversions.h:229:34: linux/modules/mtrr.ver: Datei oder Verzeichnis nicht gefunden
    /usr/src/linux-2.4/include/linux/modversions.h:230:38: linux/modules/nand_ecc.ver: Datei oder Verzeichnis nicht gefunden
    /usr/src/linux-2.4/include/linux/modversions.h:231:38: linux/modules/nand_ids.ver: Datei oder Verzeichnis nicht gefunden
    /usr/src/linux-2.4/include/linux/modversions.h:232:34: linux/modules/nand.ver: Datei oder Verzeichnis nicht gefunden
    /usr/src/linux-2.4/include/linux/modversions.h:233:39: linux/modules/netfilter.ver: Datei oder Verzeichnis nicht gefunden
    /usr/src/linux-2.4/include/linux/modversions.h:234:38: linux/modules/net_init.ver: Datei oder Verzeichnis nicht gefunden
    /usr/src/linux-2.4/include/linux/modversions.h:235:37: linux/modules/netsyms.ver: Datei oder Verzeichnis nicht gefunden
    /usr/src/linux-2.4/include/linux/modversions.h:236:38: linux/modules/nls_base.ver: Datei oder Verzeichnis nicht gefunden
    /usr/src/linux-2.4/include/linux/modversions.h:237:41: linux/modules/nm256_audio.ver: Datei oder Verzeichnis nicht gefunden
    /usr/src/linux-2.4/include/linux/modversions.h:238:40: linux/modules/nubus_syms.ver: Datei oder Verzeichnis nicht gefunden
    /usr/src/linux-2.4/include/linux/modversions.h:239:35: linux/modules/nvram.ver: Datei oder Verzeichnis nicht gefunden
    /usr/src/linux-2.4/include/linux/modversions.h:240:38: linux/modules/ohci1394.ver: Datei oder Verzeichnis nicht gefunden
    /usr/src/linux-2.4/include/linux/modversions.h:241:34: linux/modules/open.ver: Datei oder Verzeichnis nicht gefunden
    /usr/src/linux-2.4/include/linux/modversions.h:242:34: linux/modules/opl3.ver: Datei oder Verzeichnis nicht gefunden
    /usr/src/linux-2.4/include/linux/modversions.h:243:37: linux/modules/orinoco.ver: Datei oder Verzeichnis nicht gefunden
    /usr/src/linux-2.4/include/linux/modversions.h:244:35: linux/modules/ov511.ver: Datei oder Verzeichnis nicht gefunden
    /usr/src/linux-2.4/include/linux/modversions.h:245:35: linux/modules/p8022.ver: Datei oder Verzeichnis nicht gefunden
    /usr/src/linux-2.4/include/linux/modversions.h:246:40: linux/modules/page_alloc.ver: Datei oder Verzeichnis nicht gefunden
    /usr/src/linux-2.4/include/linux/modversions.h:247:38: linux/modules/pageattr.ver: Datei oder Verzeichnis nicht gefunden
    /usr/src/linux-2.4/include/linux/modversions.h:248:40: linux/modules/parport_pc.ver: Datei oder Verzeichnis nicht gefunden
    /usr/src/linux-2.4/include/linux/modversions.h:249:39: linux/modules/pc300_drv.ver: Datei oder Verzeichnis nicht gefunden
    /usr/src/linux-2.4/include/linux/modversions.h:250:37: linux/modules/pcigame.ver: Datei oder Verzeichnis nicht gefunden
    /usr/src/linux-2.4/include/linux/modversions.h:251:46: linux/modules/pci_hotplug_core.ver: Datei oder Verzeichnis nicht gefunden
    /usr/src/linux-2.4/include/linux/modversions.h:252:46: linux/modules/pci_hotplug_util.ver: Datei oder Verzeichnis nicht gefunden
    /usr/src/linux-2.4/include/linux/modversions.h:253:40: linux/modules/pci_socket.ver: Datei oder Verzeichnis nicht gefunden
    /usr/src/linux-2.4/include/linux/modversions.h:254:33: linux/modules/pci.ver: Datei oder Verzeichnis nicht gefunden
    /usr/src/linux-2.4/include/linux/modversions.h:255:38: linux/modules/phonedev.ver: Datei oder Verzeichnis nicht gefunden
    /usr/src/linux-2.4/include/linux/modversions.h:256:32: linux/modules/pm.ver: Datei oder Verzeichnis nicht gefunden
    /usr/src/linux-2.4/include/linux/modversions.h:257:39: linux/modules/posix_acl.ver: Datei oder Verzeichnis nicht gefunden
    /usr/src/linux-2.4/include/linux/modversions.h:258:39: linux/modules/ppp_async.ver: Datei oder Verzeichnis nicht gefunden
    /usr/src/linux-2.4/include/linux/modversions.h:259:41: linux/modules/ppp_generic.ver: Datei oder Verzeichnis nicht gefunden
    /usr/src/linux-2.4/include/linux/modversions.h:260:35: linux/modules/pppox.ver: Datei oder Verzeichnis nicht gefunden
    /usr/src/linux-2.4/include/linux/modversions.h:261:36: linux/modules/printk.ver: Datei oder Verzeichnis nicht gefunden
    /usr/src/linux-2.4/include/linux/modversions.h:262:39: linux/modules/processor.ver: Datei oder Verzeichnis nicht gefunden
    /usr/src/linux-2.4/include/linux/modversions.h:263:34: linux/modules/proc.ver: Datei oder Verzeichnis nicht gefunden
    /usr/src/linux-2.4/include/linux/modversions.h:264:37: linux/modules/profile.ver: Datei oder Verzeichnis nicht gefunden
    /usr/src/linux-2.4/include/linux/modversions.h:265:35: linux/modules/psnap.ver: Datei oder Verzeichnis nicht gefunden
    /usr/src/linux-2.4/include/linux/modversions.h:266:33: linux/modules/pty.ver: Datei oder Verzeichnis nicht gefunden
    /usr/src/linux-2.4/include/linux/modversions.h:267:44: linux/modules/pwc-uncompress.ver: Datei oder Verzeichnis nicht gefunden
    /usr/src/linux-2.4/include/linux/modversions.h:268:35: linux/modules/queue.ver: Datei oder Verzeichnis nicht gefunden
    /usr/src/linux-2.4/include/linux/modversions.h:269:36: linux/modules/random.ver: Datei oder Verzeichnis nicht gefunden
    /usr/src/linux-2.4/include/linux/modversions.h:270:33: linux/modules/raw.ver: Datei oder Verzeichnis nicht gefunden
    /usr/src/linux-2.4/include/linux/modversions.h:271:36: linux/modules/ray_cs.ver: Datei oder Verzeichnis nicht gefunden
    /usr/src/linux-2.4/include/linux/modversions.h:272:36: linux/modules/rbtree.ver: Datei oder Verzeichnis nicht gefunden
    /usr/src/linux-2.4/include/linux/modversions.h:273:37: linux/modules/redboot.ver: Datei oder Verzeichnis nicht gefunden
    /usr/src/linux-2.4/include/linux/modversions.h:274:39: linux/modules/resources.ver: Datei oder Verzeichnis nicht gefunden
    /usr/src/linux-2.4/include/linux/modversions.h:275:34: linux/modules/root.ver: Datei oder Verzeichnis nicht gefunden
    /usr/src/linux-2.4/include/linux/modversions.h:276:33: linux/modules/rtc.ver: Datei oder Verzeichnis nicht gefunden
    /usr/src/linux-2.4/include/linux/modversions.h:277:44: linux/modules/rwsem-spinlock.ver: Datei oder Verzeichnis nicht gefunden
    /usr/src/linux-2.4/include/linux/modversions.h:278:35: linux/modules/rwsem.ver: Datei oder Verzeichnis nicht gefunden
    /usr/src/linux-2.4/include/linux/modversions.h:279:38: linux/modules/sa1100fb.ver: Datei oder Verzeichnis nicht gefunden
    /usr/src/linux-2.4/include/linux/modversions.h:280:39: linux/modules/sb_common.ver: Datei oder Verzeichnis nicht gefunden
    /usr/src/linux-2.4/include/linux/modversions.h:281:39: linux/modules/scsi_syms.ver: Datei oder Verzeichnis nicht gefunden
    /usr/src/linux-2.4/include/linux/modversions.h:282:36: linux/modules/scx200.ver: Datei oder Verzeichnis nicht gefunden
    /usr/src/linux-2.4/include/linux/modversions.h:283:37: linux/modules/sdladrv.ver: Datei oder Verzeichnis nicht gefunden
    /usr/src/linux-2.4/include/linux/modversions.h:284:39: linux/modules/selection.ver: Datei oder Verzeichnis nicht gefunden
    /usr/src/linux-2.4/include/linux/modversions.h:285:44: linux/modules/sequencer_syms.ver: Datei oder Verzeichnis nicht gefunden
    /usr/src/linux-2.4/include/linux/modversions.h:286:36: linux/modules/serial.ver: Datei oder Verzeichnis nicht gefunden
    /usr/src/linux-2.4/include/linux/modversions.h:287:35: linux/modules/serio.ver: Datei oder Verzeichnis nicht gefunden
    /usr/src/linux-2.4/include/linux/modversions.h:288:39: linux/modules/setup-pci.ver: Datei oder Verzeichnis nicht gefunden
    /usr/src/linux-2.4/include/linux/modversions.h:289:35: linux/modules/setup.ver: Datei oder Verzeichnis nicht gefunden
    /usr/src/linux-2.4/include/linux/modversions.h:290:35: linux/modules/shmem.ver: Datei oder Verzeichnis nicht gefunden
    /usr/src/linux-2.4/include/linux/modversions.h:291:36: linux/modules/signal.ver: Datei oder Verzeichnis nicht gefunden
    /usr/src/linux-2.4/include/linux/modversions.h:292:38: linux/modules/sis_main.ver: Datei oder Verzeichnis nicht gefunden
    /usr/src/linux-2.4/include/linux/modversions.h:293:34: linux/modules/slhc.ver: Datei oder Verzeichnis nicht gefunden
    /usr/src/linux-2.4/include/linux/modversions.h:294:36: linux/modules/sonypi.ver: Datei oder Verzeichnis nicht gefunden
    /usr/src/linux-2.4/include/linux/modversions.h:295:40: linux/modules/sound_core.ver: Datei oder Verzeichnis nicht gefunden
    /usr/src/linux-2.4/include/linux/modversions.h:296:40: linux/modules/sound_syms.ver: Datei oder Verzeichnis nicht gefunden
    /usr/src/linux-2.4/include/linux/modversions.h:297:36: linux/modules/sticon.ver: Datei oder Verzeichnis nicht gefunden
    /usr/src/linux-2.4/include/linux/modversions.h:298:37: linux/modules/sticore.ver: Datei oder Verzeichnis nicht gefunden
    /usr/src/linux-2.4/include/linux/modversions.h:299:35: linux/modules/stifb.ver: Datei oder Verzeichnis nicht gefunden
    /usr/src/linux-2.4/include/linux/modversions.h:300:34: linux/modules/suni.ver: Datei oder Verzeichnis nicht gefunden
    /usr/src/linux-2.4/include/linux/modversions.h:301:41: linux/modules/sunrpc_syms.ver: Datei oder Verzeichnis nicht gefunden
    /usr/src/linux-2.4/include/linux/modversions.h:302:32: linux/modules/su.ver: Datei oder Verzeichnis nicht gefunden
    /usr/src/linux-2.4/include/linux/modversions.h:303:34: linux/modules/syms.ver: Datei oder Verzeichnis nicht gefunden
    /usr/src/linux-2.4/include/linux/modversions.h:304:37: linux/modules/syncppp.ver: Datei oder Verzeichnis nicht gefunden
    /usr/src/linux-2.4/include/linux/modversions.h:305:35: linux/modules/sysrq.ver: Datei oder Verzeichnis nicht gefunden
    /usr/src/linux-2.4/include/linux/modversions.h:306:33: linux/modules/sys.ver: Datei oder Verzeichnis nicht gefunden
    /usr/src/linux-2.4/include/linux/modversions.h:307:32: linux/modules/tc.ver: Datei oder Verzeichnis nicht gefunden
    /usr/src/linux-2.4/include/linux/modversions.h:308:34: linux/modules/time.ver: Datei oder Verzeichnis nicht gefunden
    /usr/src/linux-2.4/include/linux/modversions.h:309:38: linux/modules/tms380tr.ver: Datei oder Verzeichnis nicht gefunden
    /usr/src/linux-2.4/include/linux/modversions.h:310:39: linux/modules/tty_ioctl.ver: Datei oder Verzeichnis nicht gefunden
    /usr/src/linux-2.4/include/linux/modversions.h:311:36: linux/modules/tty_io.ver: Datei oder Verzeichnis nicht gefunden
    /usr/src/linux-2.4/include/linux/modversions.h:312:37: linux/modules/uart401.ver: Datei oder Verzeichnis nicht gefunden
    /usr/src/linux-2.4/include/linux/modversions.h:313:38: linux/modules/uPD98402.ver: Datei oder Verzeichnis nicht gefunden
    /usr/src/linux-2.4/include/linux/modversions.h:314:39: linux/modules/usbserial.ver: Datei oder Verzeichnis nicht gefunden
    /usr/src/linux-2.4/include/linux/modversions.h:315:33: linux/modules/usb.ver: Datei oder Verzeichnis nicht gefunden
    /usr/src/linux-2.4/include/linux/modversions.h:316:34: linux/modules/util.ver: Datei oder Verzeichnis nicht gefunden
    /usr/src/linux-2.4/include/linux/modversions.h:317:40: linux/modules/vac-serial.ver: Datei oder Verzeichnis nicht gefunden
    /usr/src/linux-2.4/include/linux/modversions.h:318:41: linux/modules/vfatfs_syms.ver: Datei oder Verzeichnis nicht gefunden
    /usr/src/linux-2.4/include/linux/modversions.h:319:37: linux/modules/via-pmu.ver: Datei oder Verzeichnis nicht gefunden
    /usr/src/linux-2.4/include/linux/modversions.h:320:38: linux/modules/videodev.ver: Datei oder Verzeichnis nicht gefunden
    /usr/src/linux-2.4/include/linux/modversions.h:321:37: linux/modules/wanmain.ver: Datei oder Verzeichnis nicht gefunden
    /usr/src/linux-2.4/include/linux/modversions.h:322:39: linux/modules/xattr_acl.ver: Datei oder Verzeichnis nicht gefunden
    /usr/src/linux-2.4/include/linux/modversions.h:323:35: linux/modules/xattr.ver: Datei oder Verzeichnis nicht gefunden
    /usr/src/linux-2.4/include/linux/modversions.h:324:41: linux/modules/xfrm_export.ver: Datei oder Verzeichnis nicht gefunden
    /usr/src/linux-2.4/include/linux/modversions.h:325:33: linux/modules/xor.ver: Datei oder Verzeichnis nicht gefunden
    /usr/src/linux-2.4/include/linux/modversions.h:326:35: linux/modules/yenta.ver: Datei oder Verzeichnis nicht gefunden
    /usr/src/linux-2.4/include/linux/modversions.h:327:36: linux/modules/z85230.ver: Datei oder Verzeichnis nicht gefunden
    /usr/src/linux-2.4/include/linux/modversions.h:328:41: linux/modules/zftape_syms.ver: Datei oder Verzeichnis nicht gefunden
    /usr/src/linux-2.4/include/linux/modversions.h:329:35: linux/modules/zorro.ver: Datei oder Verzeichnis nicht gefunden
    In Datei, eingefügt von /usr/include/asm/smp.h:18,
                        von /usr/include/linux/smp.h:17,
                        von /usr/include/linux/sched.h:23,
                        von /usr/include/linux/module.h:10,
                        von zaptel.c:44:
    /usr/include/asm/mpspec.h:6:25: mach_mpspec.h: Datei oder Verzeichnis nicht gefunden
    In file included from /usr/include/asm/smp.h:18,
                     from /usr/include/linux/smp.h:17,
                     from /usr/include/linux/sched.h:23,
                     from /usr/include/linux/module.h:10,
                     from zaptel.c:44:
    /usr/include/asm/mpspec.h:8: error: `MAX_MP_BUSSES' undeclared here (not in a function)
    /usr/include/asm/mpspec.h:9: error: `MAX_MP_BUSSES' undeclared here (not in a function)
    /usr/include/asm/mpspec.h:10: error: `MAX_MP_BUSSES' undeclared here (not in a function)
    /usr/include/asm/mpspec.h:12: error: `MAX_MP_BUSSES' undeclared here (not in a function)
    /usr/include/asm/mpspec.h:19: error: `MAX_APICS' undeclared here (not in a function)
    /usr/include/asm/mpspec.h:20: error: `MAX_MP_BUSSES' undeclared here (not in a function)
    /usr/include/asm/mpspec.h:20: error: conflicting types for `mp_bus_id_to_type'
    /usr/include/asm/mpspec.h:8: error: previous declaration of `mp_bus_id_to_type'
    /usr/include/asm/mpspec.h:22: error: `MAX_IRQ_SOURCES' undeclared here (not in a function)
    /usr/include/asm/mpspec.h:24: error: `MAX_MP_BUSSES' undeclared here (not in a function)
    /usr/include/asm/mpspec.h:24: error: conflicting types for `mp_bus_id_to_pci_bus'
    /usr/include/asm/mpspec.h:12: error: previous declaration of `mp_bus_id_to_pci_bus'
    /usr/include/asm/mpspec.h:54: error: `MAX_APICS' undeclared here (not in a function)
    In file included from /usr/include/asm/smp.h:20,
                     from /usr/include/linux/smp.h:17,
                     from /usr/include/linux/sched.h:23,
                     from /usr/include/linux/module.h:10,
                     from zaptel.c:44:
    /usr/include/asm/io_apic.h:120: error: `MAX_IRQ_SOURCES' undeclared here (not in a function)
    /usr/include/asm/io_apic.h:120: error: conflicting types for `mp_irqs'
    /usr/include/asm/mpspec.h:22: error: previous declaration of `mp_irqs'
    In Datei, eingefügt von /usr/include/linux/smp.h:17,
                        von /usr/include/linux/sched.h:23,
                        von /usr/include/linux/module.h:10,
                        von zaptel.c:44:
    /usr/include/asm/smp.h:73:26: mach_apicdef.h: Datei oder Verzeichnis nicht gefunden
    zaptel.c: In Funktion »zaptel_proc_read«:
    zaptel.c:434: Warnung: use of cast expressions as lvalues is deprecated
    make: *** [zaptel.o] Fehler 1
    ****************************************************
    ZAPTEL installed.
    Press <Enter> to continue, or <CTRL> + <C> to abort.
    ****************************************************
    
     
  4. Blackvel

    Blackvel Mitglied

    Registriert seit:
    4 Mai 2004
    Beiträge:
    624
    Zustimmungen:
    0
    Punkte für Erfolge:
    0
    Beruf:
    selbständig als IT-Consultant (VoIP, Asterisk, J2E
    Ort:
    Nürnberg, Einsatzorte Schwerpunkt D6-D9 (MCH, STG,
    Liegt daran, daß /usr/src/linux nicht auf /usr/src/linux-2.4 verlinkt.
    Schau mal nach /usr/src/asterisk/zaptel/Makefile, da werden mit -I Headers eingebunden mit fixem Path.

    Und die findert er nun anscheinend nicht.
     
  5. tom-tom

    tom-tom Neuer User

    Registriert seit:
    18 Okt. 2004
    Beiträge:
    163
    Zustimmungen:
    0
    Punkte für Erfolge:
    0
    Guten Abend , eine Frohes neues Euch allen.
    Kaun nacht man es richtig funktioniert es! (fast) Die Treiber lassen sich installieren. Nur leider Will Asterisk selber nicht!
    Benutze dein neuen Bristuff (RC 3)
    Es lag wie Blackvel gesagt hat am falschen Link!

    Code:
    gcc -shared -Xlinker -x -o app_test.so app_test.o
    gcc -pipe  -Wall -Wstrict-prototypes -Wmissing-prototypes -Wmissing-declarations -g  -Iinclude -I../include -D_REENTRANT -D_GNU_SOURCE  -O6 -march=i686   -DZAPTEL_OPTIMIZATIONS  -DASTERISK_VERSION=\"1.0.3-BRIstuffed-0.2.0-RC3\" -DINSTALL_PREFIX=\"\" -DASTETCDIR=\"/etc/asterisk\" -DASTLIBDIR=\"/usr/lib/asterisk\" -DASTVARLIBDIR=\"/var/lib/asterisk\" -DASTVARRUNDIR=\"/var/run\" -DASTSPOOLDIR=\"/var/spool/asterisk\" -DASTLOGDIR=\"/var/log/asterisk\" -DASTCONFPATH=\"/etc/asterisk/asterisk.conf\" -DASTMODDIR=\"/usr/lib/asterisk/modules\" -DASTAGIDIR=\"/var/lib/asterisk/agi-bin\"     -DBUSYDETECT_MARTIN      -fPIC   -c -o app_forkcdr.o app_forkcdr.c
    gcc -shared -Xlinker -x -o app_forkcdr.so app_forkcdr.o
    make[1]: *** Keine Regel vorhanden, um das Target »app_pickup.so«,
      benötigt von »all«, zu erstellen.  Schluss.
    make[1]: Leaving directory `/usr/src/bristuff-0.2.0-RC3/asterisk-1.0.3/apps'
    make: *** [subdirs] Fehler 1
    for x in res channels pbx apps codecs formats agi cdr astman stdtime; do make -C $x depend || exit 1 ; done
    make[1]: Entering directory `/usr/src/bristuff-0.2.0-RC3/asterisk-1.0.3/res'
    make[1]: Für das Ziel »depend« ist nichts zu tun.
    make[1]: Leaving directory `/usr/src/bristuff-0.2.0-RC3/asterisk-1.0.3/res'
    make[1]: Entering directory `/usr/src/bristuff-0.2.0-RC3/asterisk-1.0.3/channels'
    make[1]: Für das Ziel »depend« ist nichts zu tun.
    make[1]: Leaving directory `/usr/src/bristuff-0.2.0-RC3/asterisk-1.0.3/channels'
    make[1]: Entering directory `/usr/src/bristuff-0.2.0-RC3/asterisk-1.0.3/pbx'
    make[1]: Für das Ziel »depend« ist nichts zu tun.
    make[1]: Leaving directory `/usr/src/bristuff-0.2.0-RC3/asterisk-1.0.3/pbx'
    make[1]: Entering directory `/usr/src/bristuff-0.2.0-RC3/asterisk-1.0.3/apps'
    make[1]: Für das Ziel »depend« ist nichts zu tun.
    make[1]: Leaving directory `/usr/src/bristuff-0.2.0-RC3/asterisk-1.0.3/apps'
    make[1]: Entering directory `/usr/src/bristuff-0.2.0-RC3/asterisk-1.0.3/codecs'
    make[1]: Für das Ziel »depend« ist nichts zu tun.
    make[1]: Leaving directory `/usr/src/bristuff-0.2.0-RC3/asterisk-1.0.3/codecs'
    make[1]: Entering directory `/usr/src/bristuff-0.2.0-RC3/asterisk-1.0.3/formats'
    make[1]: Für das Ziel »depend« ist nichts zu tun.
    make[1]: Leaving directory `/usr/src/bristuff-0.2.0-RC3/asterisk-1.0.3/formats'
    make[1]: Entering directory `/usr/src/bristuff-0.2.0-RC3/asterisk-1.0.3/agi'
    make[1]: Für das Ziel »depend« ist nichts zu tun.
    make[1]: Leaving directory `/usr/src/bristuff-0.2.0-RC3/asterisk-1.0.3/agi'
    make[1]: Entering directory `/usr/src/bristuff-0.2.0-RC3/asterisk-1.0.3/cdr'
    make[1]: Für das Ziel »depend« ist nichts zu tun.
    make[1]: Leaving directory `/usr/src/bristuff-0.2.0-RC3/asterisk-1.0.3/cdr'
    make[1]: Entering directory `/usr/src/bristuff-0.2.0-RC3/asterisk-1.0.3/astman'
    make[1]: Für das Ziel »depend« ist nichts zu tun.
    make[1]: Leaving directory `/usr/src/bristuff-0.2.0-RC3/asterisk-1.0.3/astman'
    make[1]: Entering directory `/usr/src/bristuff-0.2.0-RC3/asterisk-1.0.3/stdtime'
    make[1]: Für das Ziel »depend« ist nichts zu tun.
    make[1]: Leaving directory `/usr/src/bristuff-0.2.0-RC3/asterisk-1.0.3/stdtime'
    cd editline && unset CFLAGS LIBS && test -f config.h || ./configure
    make -C editline libedit.a
    make[1]: Entering directory `/usr/src/bristuff-0.2.0-RC3/asterisk-1.0.3/editline'
    make[1]: »libedit.a« ist bereits aktualisiert.
    make[1]: Leaving directory `/usr/src/bristuff-0.2.0-RC3/asterisk-1.0.3/editline'
    make[1]: Entering directory `/usr/src/bristuff-0.2.0-RC3/asterisk-1.0.3/db1-ast'
    make[1]: »libdb1.a« ist bereits aktualisiert.
    make[1]: Leaving directory `/usr/src/bristuff-0.2.0-RC3/asterisk-1.0.3/db1-ast'
    make[1]: Entering directory `/usr/src/bristuff-0.2.0-RC3/asterisk-1.0.3/stdtime'
    make[1]: »libtime.a« ist bereits aktualisiert.
    make[1]: Leaving directory `/usr/src/bristuff-0.2.0-RC3/asterisk-1.0.3/stdtime'
    if [ -d CVS ] && ! [ -f .version ]; then echo 1.0.3-BRIstuffed-0.2.0-RC3 > .version; fi
    for x in res channels pbx apps codecs formats agi cdr astman stdtime; do make -C $x || exit 1 ; done
    make[1]: Entering directory `/usr/src/bristuff-0.2.0-RC3/asterisk-1.0.3/res'
    make[1]: Für das Ziel »all« ist nichts zu tun.
    make[1]: Leaving directory `/usr/src/bristuff-0.2.0-RC3/asterisk-1.0.3/res'
    make[1]: Entering directory `/usr/src/bristuff-0.2.0-RC3/asterisk-1.0.3/channels'
    make[1]: Für das Ziel »all« ist nichts zu tun.
    make[1]: Leaving directory `/usr/src/bristuff-0.2.0-RC3/asterisk-1.0.3/channels'
    make[1]: Entering directory `/usr/src/bristuff-0.2.0-RC3/asterisk-1.0.3/pbx'
    make[1]: Für das Ziel »all« ist nichts zu tun.
    make[1]: Leaving directory `/usr/src/bristuff-0.2.0-RC3/asterisk-1.0.3/pbx'
    make[1]: Entering directory `/usr/src/bristuff-0.2.0-RC3/asterisk-1.0.3/apps'
    make[1]: *** Keine Regel vorhanden, um das Target »app_pickup.so«,
      benötigt von »all«, zu erstellen.  Schluss.
    make[1]: Leaving directory `/usr/src/bristuff-0.2.0-RC3/asterisk-1.0.3/apps'
    make: *** [subdirs] Fehler 1
    debian:/usr/src/bristuff-0.2.0-RC3/asterisk-1.0.3#
     
  6. tom-tom

    tom-tom Neuer User

    Registriert seit:
    18 Okt. 2004
    Beiträge:
    163
    Zustimmungen:
    0
    Punkte für Erfolge:
    0
    Hab mal wieder weiter gefuscht, komme jetzt auf diesen Fehler....
    Was das "Alter" Problem behoben hat weis Ich nicht :-(

    Code:
    rm -f *.so *.o .depend
    ! [ -d g723.1 ] || make -C g723.1 clean
    ! [ -d g723.1b ] || make -C g723.1b clean
    make -C gsm clean
    make[2]: Entering directory `/usr/src/bristuff-0.2.0-RC3/asterisk-1.0.3/codecs/gsm'
    rm -f  */*.o                    \
                    ./tst/lin2cod ./tst/lin2txt     \
                    ./tst/cod2lin ./tst/cod2txt     \
                    ./tst/gsm2cod                   \
                    ./tst/*.*.*
    find . \( -name core -o -name foo \) \
            -print | xargs rm -f
    rm -f ./lib/libgsm.a ./add-test/add             \
                    ./bin/toast ./bin/tcat ./bin/untoast    \
                    ./gsm-1.0.tar.Z
    make[2]: Leaving directory `/usr/src/bristuff-0.2.0-RC3/asterisk-1.0.3/codecs/gsm'
    make -C lpc10 clean
    make[2]: Entering directory `/usr/src/bristuff-0.2.0-RC3/asterisk-1.0.3/codecs/lpc10'
    rm -f *.o ./liblpc10.a
    make[2]: Leaving directory `/usr/src/bristuff-0.2.0-RC3/asterisk-1.0.3/codecs/lpc10'
    make -C ilbc clean
    make[2]: Entering directory `/usr/src/bristuff-0.2.0-RC3/asterisk-1.0.3/codecs/ilbc'
    rm -f libilbc.a *.o
    make[2]: Leaving directory `/usr/src/bristuff-0.2.0-RC3/asterisk-1.0.3/codecs/ilbc'
    make[1]: Leaving directory `/usr/src/bristuff-0.2.0-RC3/asterisk-1.0.3/codecs'
    make[1]: Entering directory `/usr/src/bristuff-0.2.0-RC3/asterisk-1.0.3/formats'
    rm -f *.so *.o .depend
    make[1]: Leaving directory `/usr/src/bristuff-0.2.0-RC3/asterisk-1.0.3/formats'
    make[1]: Entering directory `/usr/src/bristuff-0.2.0-RC3/asterisk-1.0.3/agi'
    rm -f *.so *.o look .depend eagi-test eagi-sphinx-test
    make[1]: Leaving directory `/usr/src/bristuff-0.2.0-RC3/asterisk-1.0.3/agi'
    make[1]: Entering directory `/usr/src/bristuff-0.2.0-RC3/asterisk-1.0.3/cdr'
    rm -f *.so *.o .depend
    make[1]: Leaving directory `/usr/src/bristuff-0.2.0-RC3/asterisk-1.0.3/cdr'
    make[1]: Entering directory `/usr/src/bristuff-0.2.0-RC3/asterisk-1.0.3/astman'
    rm -f *.o astman .depend
    make[1]: Leaving directory `/usr/src/bristuff-0.2.0-RC3/asterisk-1.0.3/astman'
    make[1]: Entering directory `/usr/src/bristuff-0.2.0-RC3/asterisk-1.0.3/stdtime'
    rm -f libtime.a *.o test .depend
    make[1]: Leaving directory `/usr/src/bristuff-0.2.0-RC3/asterisk-1.0.3/stdtime'
    rm -f *.o *.so asterisk .depend
    rm -f build.h
    rm -f ast_expr.c
    make -C db1-ast clean
    make[1]: Entering directory `/usr/src/bristuff-0.2.0-RC3/asterisk-1.0.3/db1-ast'
    rm -f libdb1.a libdb.so.2 hash.o hash_bigkey.o hash_buf.o hash_func.o hash_log2.o hash_page.o ndbm.o bt_close.o bt_conv.o bt_debug.o bt_delete.o bt_get.o bt_open.o bt_overflow.o bt_page.o bt_put.o bt_search.o bt_seq.o bt_split.o bt_utils.o db.o mpool.o rec_close.o rec_delete.o rec_get.o rec_open.o rec_put.o rec_search.o rec_seq.o rec_utils.o  hash.os hash_bigkey.os hash_buf.os hash_func.os hash_log2.os hash_page.os ndbm.os bt_close.os bt_conv.os bt_debug.os bt_delete.os bt_get.os bt_open.os bt_overflow.os bt_page.os bt_put.os bt_search.os bt_seq.os bt_split.os bt_utils.os db.os mpool.os rec_close.os rec_delete.os rec_get.os rec_open.os rec_put.os rec_search.os rec_seq.os rec_utils.os
    make[1]: Leaving directory `/usr/src/bristuff-0.2.0-RC3/asterisk-1.0.3/db1-ast'
    make -C stdtime clean
    make[1]: Entering directory `/usr/src/bristuff-0.2.0-RC3/asterisk-1.0.3/stdtime'
    rm -f libtime.a *.o test .depend
    make[1]: Leaving directory `/usr/src/bristuff-0.2.0-RC3/asterisk-1.0.3/stdtime'
    ./mkdep -pipe  -Wall -Wstrict-prototypes -Wmissing-prototypes -Wmissing-declarations -g  -Iinclude -I../include -D_REENTRANT -D_GNU_SOURCE  -O6 -march=i686   -DZAPTEL_OPTIMIZATIONS  -DASTERISK_VERSION=\"1.0.3-BRIstuffed-0.2.0-RC3\" -DINSTALL_PREFIX=\"\" -DASTETCDIR=\"/etc/asterisk\" -DASTLIBDIR=\"/usr/lib/asterisk\" -DASTVARLIBDIR=\"/var/lib/asterisk\" -DASTVARRUNDIR=\"/var/run\" -DASTSPOOLDIR=\"/var/spool/asterisk\" -DASTLOGDIR=\"/var/log/asterisk\" -DASTCONFPATH=\"/etc/asterisk/asterisk.conf\" -DASTMODDIR=\"/usr/lib/asterisk/modules\" -DASTAGIDIR=\"/var/lib/asterisk/agi-bin\"     -DBUSYDETECT_MARTIN      `ls *.c`
    for x in res channels pbx apps codecs formats agi cdr astman stdtime; do make -C $x depend || exit 1 ; done
    make[1]: Entering directory `/usr/src/bristuff-0.2.0-RC3/asterisk-1.0.3/res'
    ../mkdep -pipe  -Wall -Wstrict-prototypes -Wmissing-prototypes -Wmissing-declarations -g  -Iinclude -I../include -D_REENTRANT -D_GNU_SOURCE  -O6 -march=i686   -DZAPTEL_OPTIMIZATIONS  -DASTERISK_VERSION=\"1.0.3-BRIstuffed-0.2.0-RC3\" -DINSTALL_PREFIX=\"\" -DASTETCDIR=\"/etc/asterisk\" -DASTLIBDIR=\"/usr/lib/asterisk\" -DASTVARLIBDIR=\"/var/lib/asterisk\" -DASTVARRUNDIR=\"/var/run\" -DASTSPOOLDIR=\"/var/spool/asterisk\" -DASTLOGDIR=\"/var/log/asterisk\" -DASTCONFPATH=\"/etc/asterisk/asterisk.conf\" -DASTMODDIR=\"/usr/lib/asterisk/modules\" -DASTAGIDIR=\"/var/lib/asterisk/agi-bin\"     -DBUSYDETECT_MARTIN        -DZAPATA_MOH  -DOPENSSL_NO_KRB5 -fPIC `ls *.c`
    make[1]: Leaving directory `/usr/src/bristuff-0.2.0-RC3/asterisk-1.0.3/res'
    make[1]: Entering directory `/usr/src/bristuff-0.2.0-RC3/asterisk-1.0.3/channels'
    ../mkdep -pipe  -Wall -Wstrict-prototypes -Wmissing-prototypes -Wmissing-declarations -g  -Iinclude -I../include -D_REENTRANT -D_GNU_SOURCE  -O6 -march=i686   -DZAPTEL_OPTIMIZATIONS  -DASTERISK_VERSION=\"1.0.3-BRIstuffed-0.2.0-RC3\" -DINSTALL_PREFIX=\"\" -DASTETCDIR=\"/etc/asterisk\" -DASTLIBDIR=\"/usr/lib/asterisk\" -DASTVARLIBDIR=\"/var/lib/asterisk\" -DASTVARRUNDIR=\"/var/run\" -DASTSPOOLDIR=\"/var/spool/asterisk\" -DASTLOGDIR=\"/var/log/asterisk\" -DASTCONFPATH=\"/etc/asterisk/asterisk.conf\" -DASTMODDIR=\"/usr/lib/asterisk/modules\" -DASTAGIDIR=\"/var/lib/asterisk/agi-bin\"     -DBUSYDETECT_MARTIN      -Wno-missing-prototypes -Wno-missing-declarations   -DZAPATA_PRI   -DIAX_TRUNKING   -DCRYPTO -fPIC  `ls *.c`
    make[1]: Leaving directory `/usr/src/bristuff-0.2.0-RC3/asterisk-1.0.3/channels'
    make[1]: Entering directory `/usr/src/bristuff-0.2.0-RC3/asterisk-1.0.3/pbx'
    ../mkdep -pipe  -Wall -Wstrict-prototypes -Wmissing-prototypes -Wmissing-declarations -g  -Iinclude -I../include -D_REENTRANT -D_GNU_SOURCE  -O6 -march=i686   -DZAPTEL_OPTIMIZATIONS  -DASTERISK_VERSION=\"1.0.3-BRIstuffed-0.2.0-RC3\" -DINSTALL_PREFIX=\"\" -DASTETCDIR=\"/etc/asterisk\" -DASTLIBDIR=\"/usr/lib/asterisk\" -DASTVARLIBDIR=\"/var/lib/asterisk\" -DASTVARRUNDIR=\"/var/run\" -DASTSPOOLDIR=\"/var/spool/asterisk\" -DASTLOGDIR=\"/var/log/asterisk\" -DASTCONFPATH=\"/etc/asterisk/asterisk.conf\" -DASTMODDIR=\"/usr/lib/asterisk/modules\" -DASTAGIDIR=\"/var/lib/asterisk/agi-bin\"     -DBUSYDETECT_MARTIN      -fPIC `ls *.c`
    make[1]: Leaving directory `/usr/src/bristuff-0.2.0-RC3/asterisk-1.0.3/pbx'
    make[1]: Entering directory `/usr/src/bristuff-0.2.0-RC3/asterisk-1.0.3/apps'
    ../mkdep -pipe  -Wall -Wstrict-prototypes -Wmissing-prototypes -Wmissing-declarations -g  -Iinclude -I../include -D_REENTRANT -D_GNU_SOURCE  -O6 -march=i686   -DZAPTEL_OPTIMIZATIONS  -DASTERISK_VERSION=\"1.0.3-BRIstuffed-0.2.0-RC3\" -DINSTALL_PREFIX=\"\" -DASTETCDIR=\"/etc/asterisk\" -DASTLIBDIR=\"/usr/lib/asterisk\" -DASTVARLIBDIR=\"/var/lib/asterisk\" -DASTVARRUNDIR=\"/var/run\" -DASTSPOOLDIR=\"/var/spool/asterisk\" -DASTLOGDIR=\"/var/log/asterisk\" -DASTCONFPATH=\"/etc/asterisk/asterisk.conf\" -DASTMODDIR=\"/usr/lib/asterisk/modules\" -DASTAGIDIR=\"/var/lib/asterisk/agi-bin\"     -DBUSYDETECT_MARTIN      -fPIC `ls *.c`
    make[1]: Leaving directory `/usr/src/bristuff-0.2.0-RC3/asterisk-1.0.3/apps'
    make[1]: Entering directory `/usr/src/bristuff-0.2.0-RC3/asterisk-1.0.3/codecs'
    ../mkdep -pipe  -Wall -Wstrict-prototypes -Wmissing-prototypes -Wmissing-declarations -g  -Iinclude -I../include -D_REENTRANT -D_GNU_SOURCE  -O6 -march=i686   -DZAPTEL_OPTIMIZATIONS  -DASTERISK_VERSION=\"1.0.3-BRIstuffed-0.2.0-RC3\" -DINSTALL_PREFIX=\"\" -DASTETCDIR=\"/etc/asterisk\" -DASTLIBDIR=\"/usr/lib/asterisk\" -DASTVARLIBDIR=\"/var/lib/asterisk\" -DASTVARRUNDIR=\"/var/run\" -DASTSPOOLDIR=\"/var/spool/asterisk\" -DASTLOGDIR=\"/var/log/asterisk\" -DASTCONFPATH=\"/etc/asterisk/asterisk.conf\" -DASTMODDIR=\"/usr/lib/asterisk/modules\" -DASTAGIDIR=\"/var/lib/asterisk/agi-bin\"     -DBUSYDETECT_MARTIN      -fPIC  `ls *.c`
    make[1]: Leaving directory `/usr/src/bristuff-0.2.0-RC3/asterisk-1.0.3/codecs'
    make[1]: Entering directory `/usr/src/bristuff-0.2.0-RC3/asterisk-1.0.3/formats'
    ../mkdep -pipe  -Wall -Wstrict-prototypes -Wmissing-prototypes -Wmissing-declarations -g  -Iinclude -I../include -D_REENTRANT -D_GNU_SOURCE  -O6 -march=i686   -DZAPTEL_OPTIMIZATIONS  -DASTERISK_VERSION=\"1.0.3-BRIstuffed-0.2.0-RC3\" -DINSTALL_PREFIX=\"\" -DASTETCDIR=\"/etc/asterisk\" -DASTLIBDIR=\"/usr/lib/asterisk\" -DASTVARLIBDIR=\"/var/lib/asterisk\" -DASTVARRUNDIR=\"/var/run\" -DASTSPOOLDIR=\"/var/spool/asterisk\" -DASTLOGDIR=\"/var/log/asterisk\" -DASTCONFPATH=\"/etc/asterisk/asterisk.conf\" -DASTMODDIR=\"/usr/lib/asterisk/modules\" -DASTAGIDIR=\"/var/lib/asterisk/agi-bin\"     -DBUSYDETECT_MARTIN      -fPIC `ls *.c`
    make[1]: Leaving directory `/usr/src/bristuff-0.2.0-RC3/asterisk-1.0.3/formats'
    make[1]: Entering directory `/usr/src/bristuff-0.2.0-RC3/asterisk-1.0.3/agi'
    ../mkdep -pipe  -Wall -Wstrict-prototypes -Wmissing-prototypes -Wmissing-declarations -g  -Iinclude -I../include -D_REENTRANT -D_GNU_SOURCE  -O6 -march=i686   -DZAPTEL_OPTIMIZATIONS  -DASTERISK_VERSION=\"1.0.3-BRIstuffed-0.2.0-RC3\" -DINSTALL_PREFIX=\"\" -DASTETCDIR=\"/etc/asterisk\" -DASTLIBDIR=\"/usr/lib/asterisk\" -DASTVARLIBDIR=\"/var/lib/asterisk\" -DASTVARRUNDIR=\"/var/run\" -DASTSPOOLDIR=\"/var/spool/asterisk\" -DASTLOGDIR=\"/var/log/asterisk\" -DASTCONFPATH=\"/etc/asterisk/asterisk.conf\" -DASTMODDIR=\"/usr/lib/asterisk/modules\" -DASTAGIDIR=\"/var/lib/asterisk/agi-bin\"     -DBUSYDETECT_MARTIN       `ls *.c`
    make[1]: Leaving directory `/usr/src/bristuff-0.2.0-RC3/asterisk-1.0.3/agi'
    make[1]: Entering directory `/usr/src/bristuff-0.2.0-RC3/asterisk-1.0.3/cdr'
    ../mkdep -pipe  -Wall -Wstrict-prototypes -Wmissing-prototypes -Wmissing-declarations -g  -Iinclude -I../include -D_REENTRANT -D_GNU_SOURCE  -O6 -march=i686   -DZAPTEL_OPTIMIZATIONS  -DASTERISK_VERSION=\"1.0.3-BRIstuffed-0.2.0-RC3\" -DINSTALL_PREFIX=\"\" -DASTETCDIR=\"/etc/asterisk\" -DASTLIBDIR=\"/usr/lib/asterisk\" -DASTVARLIBDIR=\"/var/lib/asterisk\" -DASTVARRUNDIR=\"/var/run\" -DASTSPOOLDIR=\"/var/spool/asterisk\" -DASTLOGDIR=\"/var/log/asterisk\" -DASTCONFPATH=\"/etc/asterisk/asterisk.conf\" -DASTMODDIR=\"/usr/lib/asterisk/modules\" -DASTAGIDIR=\"/var/lib/asterisk/agi-bin\"     -DBUSYDETECT_MARTIN      -fPIC      `ls *.c`
    make[1]: Leaving directory `/usr/src/bristuff-0.2.0-RC3/asterisk-1.0.3/cdr'
    make[1]: Entering directory `/usr/src/bristuff-0.2.0-RC3/asterisk-1.0.3/astman'
    ../mkdep -pipe  -Wall -Wstrict-prototypes -Wmissing-prototypes -Wmissing-declarations -g  -Iinclude -I../include -D_REENTRANT -D_GNU_SOURCE  -O6 -march=i686   -DZAPTEL_OPTIMIZATIONS  -DASTERISK_VERSION=\"1.0.3-BRIstuffed-0.2.0-RC3\" -DINSTALL_PREFIX=\"\" -DASTETCDIR=\"/etc/asterisk\" -DASTLIBDIR=\"/usr/lib/asterisk\" -DASTVARLIBDIR=\"/var/lib/asterisk\" -DASTVARRUNDIR=\"/var/run\" -DASTSPOOLDIR=\"/var/spool/asterisk\" -DASTLOGDIR=\"/var/log/asterisk\" -DASTCONFPATH=\"/etc/asterisk/asterisk.conf\" -DASTMODDIR=\"/usr/lib/asterisk/modules\" -DASTAGIDIR=\"/var/lib/asterisk/agi-bin\"     -DBUSYDETECT_MARTIN      -DNO_AST_MM `ls *.c`
    make[1]: Leaving directory `/usr/src/bristuff-0.2.0-RC3/asterisk-1.0.3/astman'
    make[1]: Entering directory `/usr/src/bristuff-0.2.0-RC3/asterisk-1.0.3/stdtime'
    ../mkdep -pipe  -Wall -Wstrict-prototypes -Wmissing-prototypes -Wmissing-declarations -g  -Iinclude -I../include -D_REENTRANT -D_GNU_SOURCE  -O6 -march=i686   -DZAPTEL_OPTIMIZATIONS  -DASTERISK_VERSION=\"1.0.3-BRIstuffed-0.2.0-RC3\" -DINSTALL_PREFIX=\"\" -DASTETCDIR=\"/etc/asterisk\" -DASTLIBDIR=\"/usr/lib/asterisk\" -DASTVARLIBDIR=\"/var/lib/asterisk\" -DASTVARRUNDIR=\"/var/run\" -DASTSPOOLDIR=\"/var/spool/asterisk\" -DASTLOGDIR=\"/var/log/asterisk\" -DASTCONFPATH=\"/etc/asterisk/asterisk.conf\" -DASTMODDIR=\"/usr/lib/asterisk/modules\" -DASTAGIDIR=\"/var/lib/asterisk/agi-bin\"     -DBUSYDETECT_MARTIN      *.c
    make[1]: Leaving directory `/usr/src/bristuff-0.2.0-RC3/asterisk-1.0.3/stdtime'
    cd editline && unset CFLAGS LIBS && test -f config.h || ./configure
    loading cache ./config.cache
    checking for gcc... gcc
    checking whether the C compiler (gcc  ) works... yes
    checking whether the C compiler (gcc  ) is a cross-compiler... no
    checking whether we are using GNU C... yes
    checking whether gcc accepts -g... yes
    checking how to run the C preprocessor... gcc -E
    checking host system type... i686-pc-linux-gnu
    checking for a BSD compatible install... install
    checking for ranlib... ranlib
    checking for ar... /usr/bin/ar
    checking for tgetent in -ltermcap... no
    checking for tgetent in -ltinfo... no
    checking for tgetent in -lcurses... no
    checking for tgetent in -lncurses... no
    configure: error: termcap support not found
    make: *** [editline/libedit.a] Fehler 1
    for x in res channels pbx apps codecs formats agi cdr astman stdtime; do make -C $x depend || exit 1 ; done
    make[1]: Entering directory `/usr/src/bristuff-0.2.0-RC3/asterisk-1.0.3/res'
    make[1]: Für das Ziel »depend« ist nichts zu tun.
    make[1]: Leaving directory `/usr/src/bristuff-0.2.0-RC3/asterisk-1.0.3/res'
    make[1]: Entering directory `/usr/src/bristuff-0.2.0-RC3/asterisk-1.0.3/channels'
    make[1]: Für das Ziel »depend« ist nichts zu tun.
    make[1]: Leaving directory `/usr/src/bristuff-0.2.0-RC3/asterisk-1.0.3/channels'
    make[1]: Entering directory `/usr/src/bristuff-0.2.0-RC3/asterisk-1.0.3/pbx'
    make[1]: Für das Ziel »depend« ist nichts zu tun.
    make[1]: Leaving directory `/usr/src/bristuff-0.2.0-RC3/asterisk-1.0.3/pbx'
    make[1]: Entering directory `/usr/src/bristuff-0.2.0-RC3/asterisk-1.0.3/apps'
    make[1]: Für das Ziel »depend« ist nichts zu tun.
    make[1]: Leaving directory `/usr/src/bristuff-0.2.0-RC3/asterisk-1.0.3/apps'
    make[1]: Entering directory `/usr/src/bristuff-0.2.0-RC3/asterisk-1.0.3/codecs'
    make[1]: Für das Ziel »depend« ist nichts zu tun.
    make[1]: Leaving directory `/usr/src/bristuff-0.2.0-RC3/asterisk-1.0.3/codecs'
    make[1]: Entering directory `/usr/src/bristuff-0.2.0-RC3/asterisk-1.0.3/formats'
    make[1]: Für das Ziel »depend« ist nichts zu tun.
    make[1]: Leaving directory `/usr/src/bristuff-0.2.0-RC3/asterisk-1.0.3/formats'
    make[1]: Entering directory `/usr/src/bristuff-0.2.0-RC3/asterisk-1.0.3/agi'
    make[1]: Für das Ziel »depend« ist nichts zu tun.
    make[1]: Leaving directory `/usr/src/bristuff-0.2.0-RC3/asterisk-1.0.3/agi'
    make[1]: Entering directory `/usr/src/bristuff-0.2.0-RC3/asterisk-1.0.3/cdr'
    make[1]: Für das Ziel »depend« ist nichts zu tun.
    make[1]: Leaving directory `/usr/src/bristuff-0.2.0-RC3/asterisk-1.0.3/cdr'
    make[1]: Entering directory `/usr/src/bristuff-0.2.0-RC3/asterisk-1.0.3/astman'
    make[1]: Für das Ziel »depend« ist nichts zu tun.
    make[1]: Leaving directory `/usr/src/bristuff-0.2.0-RC3/asterisk-1.0.3/astman'
    make[1]: Entering directory `/usr/src/bristuff-0.2.0-RC3/asterisk-1.0.3/stdtime'
    make[1]: Für das Ziel »depend« ist nichts zu tun.
    make[1]: Leaving directory `/usr/src/bristuff-0.2.0-RC3/asterisk-1.0.3/stdtime'
    cd editline && unset CFLAGS LIBS && test -f config.h || ./configure
    loading cache ./config.cache
    checking for gcc... gcc
    checking whether the C compiler (gcc  ) works... yes
    checking whether the C compiler (gcc  ) is a cross-compiler... no
    checking whether we are using GNU C... yes
    checking whether gcc accepts -g... yes
    checking how to run the C preprocessor... gcc -E
    checking host system type... i686-pc-linux-gnu
    checking for a BSD compatible install... install
    checking for ranlib... ranlib
    checking for ar... /usr/bin/ar
    checking for tgetent in -ltermcap... no
    checking for tgetent in -ltinfo... no
    checking for tgetent in -lcurses... no
    checking for tgetent in -lncurses... no
    configure: error: termcap support not found
    make: *** [editline/libedit.a] Fehler 1
    debian:/usr/src/bristuff-0.2.0-RC3/asterisk-1.0.3#
    
     
  7. tom-tom

    tom-tom Neuer User

    Registriert seit:
    18 Okt. 2004
    Beiträge:
    163
    Zustimmungen:
    0
    Punkte für Erfolge:
    0
    OK nachdem Ich jetzt libncurses5-dev installiert habe bekomme Ich nun den Error :-(

    Code:
    gcc -pipe  -Wall -Wstrict-prototypes -Wmissing-prototypes -Wmissing-declarations -g  -Iinclude -I../include -D_REENTRANT -D_GNU_SOURCE  -O6 -march=i686   -DZAPTEL_OPTIMIZATIONS  -DASTERISK_VERSION=\"1.0.3-BRIstuffed-0.2.0-RC3\" -DINSTALL_PREFIX=\"\" -DASTETCDIR=\"/etc/asterisk\" -DASTLIBDIR=\"/usr/lib/asterisk\" -DASTVARLIBDIR=\"/var/lib/asterisk\" -DASTVARRUNDIR=\"/var/run\" -DASTSPOOLDIR=\"/var/spool/asterisk\" -DASTLOGDIR=\"/var/log/asterisk\" -DASTCONFPATH=\"/etc/asterisk/asterisk.conf\" -DASTMODDIR=\"/usr/lib/asterisk/modules\" -DASTAGIDIR=\"/var/lib/asterisk/agi-bin\"     -DBUSYDETECT_MARTIN        -c -o app.o app.c
    gcc -pipe  -Wall -Wstrict-prototypes -Wmissing-prototypes -Wmissing-declarations -g  -Iinclude -I../include -D_REENTRANT -D_GNU_SOURCE  -O6 -march=i686   -DZAPTEL_OPTIMIZATIONS  -DASTERISK_VERSION=\"1.0.3-BRIstuffed-0.2.0-RC3\" -DINSTALL_PREFIX=\"\" -DASTETCDIR=\"/etc/asterisk\" -DASTLIBDIR=\"/usr/lib/asterisk\" -DASTVARLIBDIR=\"/var/lib/asterisk\" -DASTVARRUNDIR=\"/var/run\" -DASTSPOOLDIR=\"/var/spool/asterisk\" -DASTLOGDIR=\"/var/log/asterisk\" -DASTCONFPATH=\"/etc/asterisk/asterisk.conf\" -DASTMODDIR=\"/usr/lib/asterisk/modules\" -DASTAGIDIR=\"/var/lib/asterisk/agi-bin\"     -DBUSYDETECT_MARTIN        -c -o cdr.o cdr.c
    gcc -pipe  -Wall -Wstrict-prototypes -Wmissing-prototypes -Wmissing-declarations -g  -Iinclude -I../include -D_REENTRANT -D_GNU_SOURCE  -O6 -march=i686   -DZAPTEL_OPTIMIZATIONS  -DASTERISK_VERSION=\"1.0.3-BRIstuffed-0.2.0-RC3\" -DINSTALL_PREFIX=\"\" -DASTETCDIR=\"/etc/asterisk\" -DASTLIBDIR=\"/usr/lib/asterisk\" -DASTVARLIBDIR=\"/var/lib/asterisk\" -DASTVARRUNDIR=\"/var/run\" -DASTSPOOLDIR=\"/var/spool/asterisk\" -DASTLOGDIR=\"/var/log/asterisk\" -DASTCONFPATH=\"/etc/asterisk/asterisk.conf\" -DASTMODDIR=\"/usr/lib/asterisk/modules\" -DASTAGIDIR=\"/var/lib/asterisk/agi-bin\"     -DBUSYDETECT_MARTIN        -c -o tdd.o tdd.c
    gcc -pipe  -Wall -Wstrict-prototypes -Wmissing-prototypes -Wmissing-declarations -g  -Iinclude -I../include -D_REENTRANT -D_GNU_SOURCE  -O6 -march=i686   -DZAPTEL_OPTIMIZATIONS  -DASTERISK_VERSION=\"1.0.3-BRIstuffed-0.2.0-RC3\" -DINSTALL_PREFIX=\"\" -DASTETCDIR=\"/etc/asterisk\" -DASTLIBDIR=\"/usr/lib/asterisk\" -DASTVARLIBDIR=\"/var/lib/asterisk\" -DASTVARRUNDIR=\"/var/run\" -DASTSPOOLDIR=\"/var/spool/asterisk\" -DASTLOGDIR=\"/var/log/asterisk\" -DASTCONFPATH=\"/etc/asterisk/asterisk.conf\" -DASTMODDIR=\"/usr/lib/asterisk/modules\" -DASTAGIDIR=\"/var/lib/asterisk/agi-bin\"     -DBUSYDETECT_MARTIN        -c -o acl.o acl.c
    gcc -pipe  -Wall -Wstrict-prototypes -Wmissing-prototypes -Wmissing-declarations -g  -Iinclude -I../include -D_REENTRANT -D_GNU_SOURCE  -O6 -march=i686   -DZAPTEL_OPTIMIZATIONS  -DASTERISK_VERSION=\"1.0.3-BRIstuffed-0.2.0-RC3\" -DINSTALL_PREFIX=\"\" -DASTETCDIR=\"/etc/asterisk\" -DASTLIBDIR=\"/usr/lib/asterisk\" -DASTVARLIBDIR=\"/var/lib/asterisk\" -DASTVARRUNDIR=\"/var/run\" -DASTSPOOLDIR=\"/var/spool/asterisk\" -DASTLOGDIR=\"/var/log/asterisk\" -DASTCONFPATH=\"/etc/asterisk/asterisk.conf\" -DASTMODDIR=\"/usr/lib/asterisk/modules\" -DASTAGIDIR=\"/var/lib/asterisk/agi-bin\"     -DBUSYDETECT_MARTIN        -c -o rtp.o rtp.c
    gcc -pipe  -Wall -Wstrict-prototypes -Wmissing-prototypes -Wmissing-declarations -g  -Iinclude -I../include -D_REENTRANT -D_GNU_SOURCE  -O6 -march=i686   -DZAPTEL_OPTIMIZATIONS  -DASTERISK_VERSION=\"1.0.3-BRIstuffed-0.2.0-RC3\" -DINSTALL_PREFIX=\"\" -DASTETCDIR=\"/etc/asterisk\" -DASTLIBDIR=\"/usr/lib/asterisk\" -DASTVARLIBDIR=\"/var/lib/asterisk\" -DASTVARRUNDIR=\"/var/run\" -DASTSPOOLDIR=\"/var/spool/asterisk\" -DASTLOGDIR=\"/var/log/asterisk\" -DASTCONFPATH=\"/etc/asterisk/asterisk.conf\" -DASTMODDIR=\"/usr/lib/asterisk/modules\" -DASTAGIDIR=\"/var/lib/asterisk/agi-bin\"     -DBUSYDETECT_MARTIN        -c -o manager.o manager.c
    gcc -pipe  -Wall -Wstrict-prototypes -Wmissing-prototypes -Wmissing-declarations -g  -Iinclude -I../include -D_REENTRANT -D_GNU_SOURCE  -O6 -march=i686   -DZAPTEL_OPTIMIZATIONS  -DASTERISK_VERSION=\"1.0.3-BRIstuffed-0.2.0-RC3\" -DINSTALL_PREFIX=\"\" -DASTETCDIR=\"/etc/asterisk\" -DASTLIBDIR=\"/usr/lib/asterisk\" -DASTVARLIBDIR=\"/var/lib/asterisk\" -DASTVARRUNDIR=\"/var/run\" -DASTSPOOLDIR=\"/var/spool/asterisk\" -DASTLOGDIR=\"/var/log/asterisk\" -DASTCONFPATH=\"/etc/asterisk/asterisk.conf\" -DASTMODDIR=\"/usr/lib/asterisk/modules\" -DASTAGIDIR=\"/var/lib/asterisk/agi-bin\"     -DBUSYDETECT_MARTIN        -c -o asterisk.o asterisk.c
    bison ast_expr.y --name-prefix=ast_yy -o ast_expr.c
    gcc -pipe  -Wall -Wstrict-prototypes -Wmissing-prototypes -Wmissing-declarations -g  -Iinclude -I../include -D_REENTRANT -D_GNU_SOURCE  -O6 -march=i686   -DZAPTEL_OPTIMIZATIONS  -DASTERISK_VERSION=\"1.0.3-BRIstuffed-0.2.0-RC3\" -DINSTALL_PREFIX=\"\" -DASTETCDIR=\"/etc/asterisk\" -DASTLIBDIR=\"/usr/lib/asterisk\" -DASTVARLIBDIR=\"/var/lib/asterisk\" -DASTVARRUNDIR=\"/var/run\" -DASTSPOOLDIR=\"/var/spool/asterisk\" -DASTLOGDIR=\"/var/log/asterisk\" -DASTCONFPATH=\"/etc/asterisk/asterisk.conf\" -DASTMODDIR=\"/usr/lib/asterisk/modules\" -DASTAGIDIR=\"/var/lib/asterisk/agi-bin\"     -DBUSYDETECT_MARTIN        -c -o ast_expr.o ast_expr.c
    gcc -pipe  -Wall -Wstrict-prototypes -Wmissing-prototypes -Wmissing-declarations -g  -Iinclude -I../include -D_REENTRANT -D_GNU_SOURCE  -O6 -march=i686   -DZAPTEL_OPTIMIZATIONS  -DASTERISK_VERSION=\"1.0.3-BRIstuffed-0.2.0-RC3\" -DINSTALL_PREFIX=\"\" -DASTETCDIR=\"/etc/asterisk\" -DASTLIBDIR=\"/usr/lib/asterisk\" -DASTVARLIBDIR=\"/var/lib/asterisk\" -DASTVARRUNDIR=\"/var/run\" -DASTSPOOLDIR=\"/var/spool/asterisk\" -DASTLOGDIR=\"/var/log/asterisk\" -DASTCONFPATH=\"/etc/asterisk/asterisk.conf\" -DASTMODDIR=\"/usr/lib/asterisk/modules\" -DASTAGIDIR=\"/var/lib/asterisk/agi-bin\"     -DBUSYDETECT_MARTIN        -c -o dsp.o dsp.c
    gcc -pipe  -Wall -Wstrict-prototypes -Wmissing-prototypes -Wmissing-declarations -g  -Iinclude -I../include -D_REENTRANT -D_GNU_SOURCE  -O6 -march=i686   -DZAPTEL_OPTIMIZATIONS  -DASTERISK_VERSION=\"1.0.3-BRIstuffed-0.2.0-RC3\" -DINSTALL_PREFIX=\"\" -DASTETCDIR=\"/etc/asterisk\" -DASTLIBDIR=\"/usr/lib/asterisk\" -DASTVARLIBDIR=\"/var/lib/asterisk\" -DASTVARRUNDIR=\"/var/run\" -DASTSPOOLDIR=\"/var/spool/asterisk\" -DASTLOGDIR=\"/var/log/asterisk\" -DASTCONFPATH=\"/etc/asterisk/asterisk.conf\" -DASTMODDIR=\"/usr/lib/asterisk/modules\" -DASTAGIDIR=\"/var/lib/asterisk/agi-bin\"     -DBUSYDETECT_MARTIN        -c -o chanvars.o chanvars.c
    gcc -pipe  -Wall -Wstrict-prototypes -Wmissing-prototypes -Wmissing-declarations -g  -Iinclude -I../include -D_REENTRANT -D_GNU_SOURCE  -O6 -march=i686   -DZAPTEL_OPTIMIZATIONS  -DASTERISK_VERSION=\"1.0.3-BRIstuffed-0.2.0-RC3\" -DINSTALL_PREFIX=\"\" -DASTETCDIR=\"/etc/asterisk\" -DASTLIBDIR=\"/usr/lib/asterisk\" -DASTVARLIBDIR=\"/var/lib/asterisk\" -DASTVARRUNDIR=\"/var/run\" -DASTSPOOLDIR=\"/var/spool/asterisk\" -DASTLOGDIR=\"/var/log/asterisk\" -DASTCONFPATH=\"/etc/asterisk/asterisk.conf\" -DASTMODDIR=\"/usr/lib/asterisk/modules\" -DASTAGIDIR=\"/var/lib/asterisk/agi-bin\"     -DBUSYDETECT_MARTIN        -c -o indications.o indications.c
    gcc -pipe  -Wall -Wstrict-prototypes -Wmissing-prototypes -Wmissing-declarations -g  -Iinclude -I../include -D_REENTRANT -D_GNU_SOURCE  -O6 -march=i686   -DZAPTEL_OPTIMIZATIONS  -DASTERISK_VERSION=\"1.0.3-BRIstuffed-0.2.0-RC3\" -DINSTALL_PREFIX=\"\" -DASTETCDIR=\"/etc/asterisk\" -DASTLIBDIR=\"/usr/lib/asterisk\" -DASTVARLIBDIR=\"/var/lib/asterisk\" -DASTVARRUNDIR=\"/var/run\" -DASTSPOOLDIR=\"/var/spool/asterisk\" -DASTLOGDIR=\"/var/log/asterisk\" -DASTCONFPATH=\"/etc/asterisk/asterisk.conf\" -DASTMODDIR=\"/usr/lib/asterisk/modules\" -DASTAGIDIR=\"/var/lib/asterisk/agi-bin\"     -DBUSYDETECT_MARTIN        -c -o autoservice.o autoservice.c
    gcc -pipe  -Wall -Wstrict-prototypes -Wmissing-prototypes -Wmissing-declarations -g  -Iinclude -I../include -D_REENTRANT -D_GNU_SOURCE  -O6 -march=i686   -DZAPTEL_OPTIMIZATIONS  -DASTERISK_VERSION=\"1.0.3-BRIstuffed-0.2.0-RC3\" -DINSTALL_PREFIX=\"\" -DASTETCDIR=\"/etc/asterisk\" -DASTLIBDIR=\"/usr/lib/asterisk\" -DASTVARLIBDIR=\"/var/lib/asterisk\" -DASTVARRUNDIR=\"/var/run\" -DASTSPOOLDIR=\"/var/spool/asterisk\" -DASTLOGDIR=\"/var/log/asterisk\" -DASTCONFPATH=\"/etc/asterisk/asterisk.conf\" -DASTMODDIR=\"/usr/lib/asterisk/modules\" -DASTAGIDIR=\"/var/lib/asterisk/agi-bin\"     -DBUSYDETECT_MARTIN        -c -o db.o db.c
    gcc -pipe  -Wall -Wstrict-prototypes -Wmissing-prototypes -Wmissing-declarations -g  -Iinclude -I../include -D_REENTRANT -D_GNU_SOURCE  -O6 -march=i686   -DZAPTEL_OPTIMIZATIONS  -DASTERISK_VERSION=\"1.0.3-BRIstuffed-0.2.0-RC3\" -DINSTALL_PREFIX=\"\" -DASTETCDIR=\"/etc/asterisk\" -DASTLIBDIR=\"/usr/lib/asterisk\" -DASTVARLIBDIR=\"/var/lib/asterisk\" -DASTVARRUNDIR=\"/var/run\" -DASTSPOOLDIR=\"/var/spool/asterisk\" -DASTLOGDIR=\"/var/log/asterisk\" -DASTCONFPATH=\"/etc/asterisk/asterisk.conf\" -DASTMODDIR=\"/usr/lib/asterisk/modules\" -DASTAGIDIR=\"/var/lib/asterisk/agi-bin\"     -DBUSYDETECT_MARTIN        -c -o privacy.o privacy.c
    gcc -pipe  -Wall -Wstrict-prototypes -Wmissing-prototypes -Wmissing-declarations -g  -Iinclude -I../include -D_REENTRANT -D_GNU_SOURCE  -O6 -march=i686   -DZAPTEL_OPTIMIZATIONS  -DASTERISK_VERSION=\"1.0.3-BRIstuffed-0.2.0-RC3\" -DINSTALL_PREFIX=\"\" -DASTETCDIR=\"/etc/asterisk\" -DASTLIBDIR=\"/usr/lib/asterisk\" -DASTVARLIBDIR=\"/var/lib/asterisk\" -DASTVARRUNDIR=\"/var/run\" -DASTSPOOLDIR=\"/var/spool/asterisk\" -DASTLOGDIR=\"/var/log/asterisk\" -DASTCONFPATH=\"/etc/asterisk/asterisk.conf\" -DASTMODDIR=\"/usr/lib/asterisk/modules\" -DASTAGIDIR=\"/var/lib/asterisk/agi-bin\"     -DBUSYDETECT_MARTIN        -c -o astmm.o astmm.c
    gcc -pipe  -Wall -Wstrict-prototypes -Wmissing-prototypes -Wmissing-declarations -g  -Iinclude -I../include -D_REENTRANT -D_GNU_SOURCE  -O6 -march=i686   -DZAPTEL_OPTIMIZATIONS  -DASTERISK_VERSION=\"1.0.3-BRIstuffed-0.2.0-RC3\" -DINSTALL_PREFIX=\"\" -DASTETCDIR=\"/etc/asterisk\" -DASTLIBDIR=\"/usr/lib/asterisk\" -DASTVARLIBDIR=\"/var/lib/asterisk\" -DASTVARRUNDIR=\"/var/run\" -DASTSPOOLDIR=\"/var/spool/asterisk\" -DASTLOGDIR=\"/var/log/asterisk\" -DASTCONFPATH=\"/etc/asterisk/asterisk.conf\" -DASTMODDIR=\"/usr/lib/asterisk/modules\" -DASTAGIDIR=\"/var/lib/asterisk/agi-bin\"     -DBUSYDETECT_MARTIN        -c -o enum.o enum.c
    gcc -pipe  -Wall -Wstrict-prototypes -Wmissing-prototypes -Wmissing-declarations -g  -Iinclude -I../include -D_REENTRANT -D_GNU_SOURCE  -O6 -march=i686   -DZAPTEL_OPTIMIZATIONS  -DASTERISK_VERSION=\"1.0.3-BRIstuffed-0.2.0-RC3\" -DINSTALL_PREFIX=\"\" -DASTETCDIR=\"/etc/asterisk\" -DASTLIBDIR=\"/usr/lib/asterisk\" -DASTVARLIBDIR=\"/var/lib/asterisk\" -DASTVARRUNDIR=\"/var/run\" -DASTSPOOLDIR=\"/var/spool/asterisk\" -DASTLOGDIR=\"/var/log/asterisk\" -DASTCONFPATH=\"/etc/asterisk/asterisk.conf\" -DASTMODDIR=\"/usr/lib/asterisk/modules\" -DASTAGIDIR=\"/var/lib/asterisk/agi-bin\"     -DBUSYDETECT_MARTIN        -c -o srv.o srv.c
    gcc -pipe  -Wall -Wstrict-prototypes -Wmissing-prototypes -Wmissing-declarations -g  -Iinclude -I../include -D_REENTRANT -D_GNU_SOURCE  -O6 -march=i686   -DZAPTEL_OPTIMIZATIONS  -DASTERISK_VERSION=\"1.0.3-BRIstuffed-0.2.0-RC3\" -DINSTALL_PREFIX=\"\" -DASTETCDIR=\"/etc/asterisk\" -DASTLIBDIR=\"/usr/lib/asterisk\" -DASTVARLIBDIR=\"/var/lib/asterisk\" -DASTVARRUNDIR=\"/var/run\" -DASTSPOOLDIR=\"/var/spool/asterisk\" -DASTLOGDIR=\"/var/log/asterisk\" -DASTCONFPATH=\"/etc/asterisk/asterisk.conf\" -DASTMODDIR=\"/usr/lib/asterisk/modules\" -DASTAGIDIR=\"/var/lib/asterisk/agi-bin\"     -DBUSYDETECT_MARTIN        -c -o dns.o dns.c
    gcc -pipe  -Wall -Wstrict-prototypes -Wmissing-prototypes -Wmissing-declarations -g  -Iinclude -I../include -D_REENTRANT -D_GNU_SOURCE  -O6 -march=i686   -DZAPTEL_OPTIMIZATIONS  -DASTERISK_VERSION=\"1.0.3-BRIstuffed-0.2.0-RC3\" -DINSTALL_PREFIX=\"\" -DASTETCDIR=\"/etc/asterisk\" -DASTLIBDIR=\"/usr/lib/asterisk\" -DASTVARLIBDIR=\"/var/lib/asterisk\" -DASTVARRUNDIR=\"/var/run\" -DASTSPOOLDIR=\"/var/spool/asterisk\" -DASTLOGDIR=\"/var/log/asterisk\" -DASTCONFPATH=\"/etc/asterisk/asterisk.conf\" -DASTMODDIR=\"/usr/lib/asterisk/modules\" -DASTAGIDIR=\"/var/lib/asterisk/agi-bin\"     -DBUSYDETECT_MARTIN        -c -o aescrypt.o aescrypt.c
    gcc -pipe  -Wall -Wstrict-prototypes -Wmissing-prototypes -Wmissing-declarations -g  -Iinclude -I../include -D_REENTRANT -D_GNU_SOURCE  -O6 -march=i686   -DZAPTEL_OPTIMIZATIONS  -DASTERISK_VERSION=\"1.0.3-BRIstuffed-0.2.0-RC3\" -DINSTALL_PREFIX=\"\" -DASTETCDIR=\"/etc/asterisk\" -DASTLIBDIR=\"/usr/lib/asterisk\" -DASTVARLIBDIR=\"/var/lib/asterisk\" -DASTVARRUNDIR=\"/var/run\" -DASTSPOOLDIR=\"/var/spool/asterisk\" -DASTLOGDIR=\"/var/log/asterisk\" -DASTCONFPATH=\"/etc/asterisk/asterisk.conf\" -DASTMODDIR=\"/usr/lib/asterisk/modules\" -DASTAGIDIR=\"/var/lib/asterisk/agi-bin\"     -DBUSYDETECT_MARTIN        -c -o aestab.o aestab.c
    gcc -pipe  -Wall -Wstrict-prototypes -Wmissing-prototypes -Wmissing-declarations -g  -Iinclude -I../include -D_REENTRANT -D_GNU_SOURCE  -O6 -march=i686   -DZAPTEL_OPTIMIZATIONS  -DASTERISK_VERSION=\"1.0.3-BRIstuffed-0.2.0-RC3\" -DINSTALL_PREFIX=\"\" -DASTETCDIR=\"/etc/asterisk\" -DASTLIBDIR=\"/usr/lib/asterisk\" -DASTVARLIBDIR=\"/var/lib/asterisk\" -DASTVARRUNDIR=\"/var/run\" -DASTSPOOLDIR=\"/var/spool/asterisk\" -DASTLOGDIR=\"/var/log/asterisk\" -DASTCONFPATH=\"/etc/asterisk/asterisk.conf\" -DASTMODDIR=\"/usr/lib/asterisk/modules\" -DASTAGIDIR=\"/var/lib/asterisk/agi-bin\"     -DBUSYDETECT_MARTIN        -c -o aeskey.o aeskey.c
    gcc -pipe  -Wall -Wstrict-prototypes -Wmissing-prototypes -Wmissing-declarations -g  -Iinclude -I../include -D_REENTRANT -D_GNU_SOURCE  -O6 -march=i686   -DZAPTEL_OPTIMIZATIONS  -DASTERISK_VERSION=\"1.0.3-BRIstuffed-0.2.0-RC3\" -DINSTALL_PREFIX=\"\" -DASTETCDIR=\"/etc/asterisk\" -DASTLIBDIR=\"/usr/lib/asterisk\" -DASTVARLIBDIR=\"/var/lib/asterisk\" -DASTVARRUNDIR=\"/var/run\" -DASTSPOOLDIR=\"/var/spool/asterisk\" -DASTLOGDIR=\"/var/log/asterisk\" -DASTCONFPATH=\"/etc/asterisk/asterisk.conf\" -DASTMODDIR=\"/usr/lib/asterisk/modules\" -DASTAGIDIR=\"/var/lib/asterisk/agi-bin\"     -DBUSYDETECT_MARTIN        -c -o utils.o utils.c
    gcc -g  -o asterisk -Wl,-E  io.o sched.o logger.o frame.o loader.o config.o channel.o translate.o file.o say.o pbx.o cli.o md5.o term.o ulaw.o alaw.o callerid.o fskmodem.o image.o app.o cdr.o tdd.o acl.o rtp.o manager.o asterisk.o ast_expr.o dsp.o chanvars.o indications.o autoservice.o db.o privacy.o astmm.o enum.o srv.o dns.o aescrypt.o aestab.o aeskey.o utils.o  editline/libedit.a db1-ast/libdb1.a stdtime/libtime.a -ldl -lpthread -lncurses -lm -lresolv   -lssl
    /usr/bin/ld: cannot find -lssl
    collect2: ld returned 1 exit status
    make: *** [asterisk] Fehler 1
    for x in res channels pbx apps codecs formats agi cdr astman stdtime; do make -C $x depend || exit 1 ; done
    make[1]: Entering directory `/usr/src/bristuff-0.2.0-RC3/asterisk-1.0.3/res'
    make[1]: Für das Ziel »depend« ist nichts zu tun.
    make[1]: Leaving directory `/usr/src/bristuff-0.2.0-RC3/asterisk-1.0.3/res'
    make[1]: Entering directory `/usr/src/bristuff-0.2.0-RC3/asterisk-1.0.3/channels'
    make[1]: Für das Ziel »depend« ist nichts zu tun.
    make[1]: Leaving directory `/usr/src/bristuff-0.2.0-RC3/asterisk-1.0.3/channels'
    make[1]: Entering directory `/usr/src/bristuff-0.2.0-RC3/asterisk-1.0.3/pbx'
    make[1]: Für das Ziel »depend« ist nichts zu tun.
    make[1]: Leaving directory `/usr/src/bristuff-0.2.0-RC3/asterisk-1.0.3/pbx'
    make[1]: Entering directory `/usr/src/bristuff-0.2.0-RC3/asterisk-1.0.3/apps'
    make[1]: Für das Ziel »depend« ist nichts zu tun.
    make[1]: Leaving directory `/usr/src/bristuff-0.2.0-RC3/asterisk-1.0.3/apps'
    make[1]: Entering directory `/usr/src/bristuff-0.2.0-RC3/asterisk-1.0.3/codecs'
    make[1]: Für das Ziel »depend« ist nichts zu tun.
    make[1]: Leaving directory `/usr/src/bristuff-0.2.0-RC3/asterisk-1.0.3/codecs'
    make[1]: Entering directory `/usr/src/bristuff-0.2.0-RC3/asterisk-1.0.3/formats'
    make[1]: Für das Ziel »depend« ist nichts zu tun.
    make[1]: Leaving directory `/usr/src/bristuff-0.2.0-RC3/asterisk-1.0.3/formats'
    make[1]: Entering directory `/usr/src/bristuff-0.2.0-RC3/asterisk-1.0.3/agi'
    make[1]: Für das Ziel »depend« ist nichts zu tun.
    make[1]: Leaving directory `/usr/src/bristuff-0.2.0-RC3/asterisk-1.0.3/agi'
    make[1]: Entering directory `/usr/src/bristuff-0.2.0-RC3/asterisk-1.0.3/cdr'
    make[1]: Für das Ziel »depend« ist nichts zu tun.
    make[1]: Leaving directory `/usr/src/bristuff-0.2.0-RC3/asterisk-1.0.3/cdr'
    make[1]: Entering directory `/usr/src/bristuff-0.2.0-RC3/asterisk-1.0.3/astman'
    make[1]: Für das Ziel »depend« ist nichts zu tun.
    make[1]: Leaving directory `/usr/src/bristuff-0.2.0-RC3/asterisk-1.0.3/astman'
    make[1]: Entering directory `/usr/src/bristuff-0.2.0-RC3/asterisk-1.0.3/stdtime'
    make[1]: Für das Ziel »depend« ist nichts zu tun.
    make[1]: Leaving directory `/usr/src/bristuff-0.2.0-RC3/asterisk-1.0.3/stdtime'
    cd editline && unset CFLAGS LIBS && test -f config.h || ./configure
    make -C editline libedit.a
    make[1]: Entering directory `/usr/src/bristuff-0.2.0-RC3/asterisk-1.0.3/editline'
    make[1]: »libedit.a« ist bereits aktualisiert.
    make[1]: Leaving directory `/usr/src/bristuff-0.2.0-RC3/asterisk-1.0.3/editline'
    make[1]: Entering directory `/usr/src/bristuff-0.2.0-RC3/asterisk-1.0.3/db1-ast'
    make[1]: »libdb1.a« ist bereits aktualisiert.
    make[1]: Leaving directory `/usr/src/bristuff-0.2.0-RC3/asterisk-1.0.3/db1-ast'
    make[1]: Entering directory `/usr/src/bristuff-0.2.0-RC3/asterisk-1.0.3/stdtime'
    make[1]: »libtime.a« ist bereits aktualisiert.
    make[1]: Leaving directory `/usr/src/bristuff-0.2.0-RC3/asterisk-1.0.3/stdtime'
    if [ -d CVS ] && ! [ -f .version ]; then echo 1.0.3-BRIstuffed-0.2.0-RC3 > .version; fi
    gcc -g  -o asterisk -Wl,-E  io.o sched.o logger.o frame.o loader.o config.o channel.o translate.o file.o say.o pbx.o cli.o md5.o term.o ulaw.o alaw.o callerid.o fskmodem.o image.o app.o cdr.o tdd.o acl.o rtp.o manager.o asterisk.o ast_expr.o dsp.o chanvars.o indications.o autoservice.o db.o privacy.o astmm.o enum.o srv.o dns.o aescrypt.o aestab.o aeskey.o utils.o  editline/libedit.a db1-ast/libdb1.a stdtime/libtime.a -ldl -lpthread -lncurses -lm -lresolv   -lssl
    /usr/bin/ld: cannot find -lssl
    collect2: ld returned 1 exit status
    make: *** [asterisk] Fehler 1
    debian:/usr/src/bristuff-0.2.0-RC3/asterisk-1.0.3#
    
     
  8. diabolos05

    diabolos05 Neuer User

    Registriert seit:
    30 Dez. 2004
    Beiträge:
    20
    Zustimmungen:
    0
    Punkte für Erfolge:
    0
    > /usr/bin/ld: cannot find -lssl

    Wer auf asterisk.org lesen kann ist ganz klar von Vorteil ;-)

    Things you will want to install Asterisk and/or Zaptel:

    * ncurses, and associated -devel
    * openssl, and associated -devel
    * zlib, and associated -devel
    * bison, and associated -devel
    * Linux 2.4 kernel sources
     
  9. tom-tom

    tom-tom Neuer User

    Registriert seit:
    18 Okt. 2004
    Beiträge:
    163
    Zustimmungen:
    0
    Punkte für Erfolge:
    0
    Danke für die Antwort !

    > /usr/bin/ld: cannot find -lssl

    Heist das Ich was jetzt noch installieren muss?
     
  10. diabolos05

    diabolos05 Neuer User

    Registriert seit:
    30 Dez. 2004
    Beiträge:
    20
    Zustimmungen:
    0
    Punkte für Erfolge:
    0
    Ja. und zwar

    * openssl, and associated -devel
     
  11. tom-tom

    tom-tom Neuer User

    Registriert seit:
    18 Okt. 2004
    Beiträge:
    163
    Zustimmungen:
    0
    Punkte für Erfolge:
    0
    Danke! Das wars Bristuff läuft soweit durch ;-) Aber der Finale Stoss der make load des HFC treiber hackt noch !

    Code:
    debian:/usr/src/bristuff-0.2.0-RC3/zaphfc# make load
    sync
    modprobe zaptel
    /lib/modules/2.4.27-1-386/misc/zaptel.o: /lib/modules/2.4.27-1-386/misc/zaptel.o: unresolved symbol remove_wait_queue_R45b432d5
    /lib/modules/2.4.27-1-386/misc/zaptel.o: /lib/modules/2.4.27-1-386/misc/zaptel.o: unresolved symbol devfs_mk_dir_Ra97b8b7f
    /lib/modules/2.4.27-1-386/misc/zaptel.o: /lib/modules/2.4.27-1-386/misc/zaptel.o: unresolved symbol devfs_register_chrdev_R65a5d2ec
    /lib/modules/2.4.27-1-386/misc/zaptel.o: /lib/modules/2.4.27-1-386/misc/zaptel.o: unresolved symbol devfs_mk_symlink_Rc227b4f4
    /lib/modules/2.4.27-1-386/misc/zaptel.o: /lib/modules/2.4.27-1-386/misc/zaptel.o: unresolved symbol __pollwait_Rcf35dcd3
    /lib/modules/2.4.27-1-386/misc/zaptel.o: /lib/modules/2.4.27-1-386/misc/zaptel.o: unresolved symbol create_proc_entry_R6f117def
    /lib/modules/2.4.27-1-386/misc/zaptel.o: /lib/modules/2.4.27-1-386/misc/zaptel.o: unresolved symbol add_wait_queue_R1851d7ea
    /lib/modules/2.4.27-1-386/misc/zaptel.o: /lib/modules/2.4.27-1-386/misc/zaptel.o: unresolved symbol remove_proc_entry_R3183023b
    /lib/modules/2.4.27-1-386/misc/zaptel.o: /lib/modules/2.4.27-1-386/misc/zaptel.o: unresolved symbol proc_mkdir_Rfc3afafa
    /lib/modules/2.4.27-1-386/misc/zaptel.o: /lib/modules/2.4.27-1-386/misc/zaptel.o: unresolved symbol devfs_unregister_R56777289
    /lib/modules/2.4.27-1-386/misc/zaptel.o: /lib/modules/2.4.27-1-386/misc/zaptel.o: unresolved symbol devfs_generate_path_R55a5d279
    /lib/modules/2.4.27-1-386/misc/zaptel.o: /lib/modules/2.4.27-1-386/misc/zaptel.o: unresolved symbol devfs_register_Rff038ff5
    /lib/modules/2.4.27-1-386/misc/zaptel.o: insmod /lib/modules/2.4.27-1-386/misc/zaptel.o failed
    /lib/modules/2.4.27-1-386/misc/zaptel.o: insmod zaptel failed
    make: *** [loadlinux24] Fehler 255
    Ich möchte 2 ISDN Karten benutzen, muss Ich dabei etwas spezielles beachten? Ne , oder? Beide sollen im TE Mod. laufen.
     
  12. lo4dro

    lo4dro Mitglied

    Registriert seit:
    14 Okt. 2004
    Beiträge:
    656
    Zustimmungen:
    0
    Punkte für Erfolge:
    0
    @tom-tom
    Kann es sein das du einen anderen Kernel nutzt als den gegen den du die Treiber gelinkt hast?
     
  13. tom-tom

    tom-tom Neuer User

    Registriert seit:
    18 Okt. 2004
    Beiträge:
    163
    Zustimmungen:
    0
    Punkte für Erfolge:
    0
    Nein eigentlich nicht"

    Code:
    debian:~# cat /proc/version
    Linux version 2.4.27-1-386 (joshk@trollwife) (gcc version 3.3.4 (Debian 1:3.3.4-9)) #1 Fri Sep 3 06:24:46 UTC 2004
    
    debian:/usr/src# ls
    bristuff-0.2.0-RC3           kernel-source-2.4.27
    kernel-headers-2.4.27-1      kernel-source-2.4.27.tar.bz2
    kernel-headers-2.4.27-1-386  linux
    
     
  14. tom-tom

    tom-tom Neuer User

    Registriert seit:
    18 Okt. 2004
    Beiträge:
    163
    Zustimmungen:
    0
    Punkte für Erfolge:
    0
    Ich habe heute den Tag über mal im Internet gesucht aber auch keine Hilfe zum Fehler gefunden. Auch habe ich die "systemvorraussetzungen" noch einmacl überprüft ob alle libaries etc. installiert sind. Leider bin Ich noch keinen schritt weiter gekommen. Hat Jemand eine Idee?
     
  15. lo4dro

    lo4dro Mitglied

    Registriert seit:
    14 Okt. 2004
    Beiträge:
    656
    Zustimmungen:
    0
    Punkte für Erfolge:
    0
    Versuch es mal mit einem eigenen Kernel.
     
  16. tom-tom

    tom-tom Neuer User

    Registriert seit:
    18 Okt. 2004
    Beiträge:
    163
    Zustimmungen:
    0
    Punkte für Erfolge:
    0
    Ich habe jetzt die config aus /boot/ ins /usr/src verzeichnis kopiert und umbenannt.
    Danach "make menueconfig" ausgeführt und das programm nach dem speichern der config sofort wieder verlassen und dann make dep ausgeführt.

    Habe also nen eigenen Kernel erstellt?

    Danach ins Bristuff verzeichnis gewechselt und die compile.sh ausgeführt.
    Lief alles sauber durch. Aber make load funzt immer noch nicht. Selber Fehler.
     
  17. rajo

    rajo Admin-Team

    Registriert seit:
    31 März 2004
    Beiträge:
    1,958
    Zustimmungen:
    0
    Punkte für Erfolge:
    36
  18. tom-tom

    tom-tom Neuer User

    Registriert seit:
    18 Okt. 2004
    Beiträge:
    163
    Zustimmungen:
    0
    Punkte für Erfolge:
    0
    Danke Werde das mal ausprobieren! Gibt es auch eine andere möglichkeit Asterisk inklusive HFC treiber schneller/einfacher zu installieren? Das ist ja ein gefusche bis man am Ziel ist. Oder liegt es nur daran das is nen Linux Noob bin?
     
  19. tom-tom

    tom-tom Neuer User

    Registriert seit:
    18 Okt. 2004
    Beiträge:
    163
    Zustimmungen:
    0
    Punkte für Erfolge:
    0
    Hab nun versucht den kernel mit der Anleitung von Rajo zu erstellen. Und habe dann , denn Kernel in Grub Eingetragen (durch copy passt eines Eintrag und dann meinen kernel namen Eingetragen) Starte Ich jetzt mit meinem Kernel bekomme Ich 10 oder 15x mal die Meldung

    Code:
    Can´t open depnces file /lib/modules/2.4.27/modules.dep
    (No such file or directory)
    Da lügt er aber das File so wie die Directory sind da!
    Am schluss äussert er noch Kernel Panic: Attempt to kill init!

    :-( Jemand eine Idee?
     
  20. rajo

    rajo Admin-Team

    Registriert seit:
    31 März 2004
    Beiträge:
    1,958
    Zustimmungen:
    0
    Punkte für Erfolge:
    36
    ich hab den eindruck, dass da irgendwas komplett durcheinander ist...

    IMO am besten:

    1. Debian neu installieren
    2. apt-get install kernel-package
    3. kernel sourcen von www.kernel.org herunterladen
    4. sourcen entpacken, aus /boot die config als .config im entpackten kernel-verzeichnis hinlegen
    5. make-kpkg --revision=meinneuerkernel1 kernel_image
    6. warten
    7. dpkg -i ../kernel-image....xyz....-meinneuerkernel1
    8. reboot
    9. fertig