Build Fehler FB 7490 v7

blackstar

Neuer User
Mitglied seit
22 Jan 2007
Beiträge
191
Punkte für Reaktionen
7
Punkte
18
patching file usr/bin/system_status
Hunk #1 FAILED at 13.
1 out of 1 hunk FAILED -- saving rejects to file usr/bin/system_status.rej
----------------------------------------------------------------------
ERROR: modpatch: Error in patch-file ./patches/cond/system_status.patch
Makefile:309: die Regel für Ziel \u201efirmware-nocompile\u201c scheiterte
make: *** [firmware-nocompile] Fehler 2

ich hatte den Fehler schon mal da war es mit nem neuen Checkout erledigt diesmal leider nicht wo liegt da evt der Fehler
 

Anhänge

CIF Mount wird nich mit eingebunden im WEBIF ist es vorhanden
aber ohne funktion
 
Kostenlos!

Statistik des Forums

Themen
248,916
Beiträge
2,304,993
Mitglieder
378,631
Neuestes Mitglied
realprogrammer